program: Orca
programVersion: 4.2.1
elementType: S O O O O O O N N N N N C C C C C C C C C C C C C C C C C H H H H H H H H H H H H H H H H H H H
charge: 0
multiplicity: 1
keywords: wb97x-d3
keywords: def2-TZVPP
keywords: def2/J RIJCOSX GRIDX6 NOFINALGRIDX
keywords: grid4 nofinalgrid
keywords: scfconv7
keywords: smallprint printgap noloewdin
keywords: NOSOSCF
formula: C17H19N5O6S
InChI: InChI=1S/C17H19N5O6S/c1-27-13-9-14(28-2)19-16(18-13)20-17(24)22-29(25,26)21-12-6-4-3-5-11(12)15(23)10-7-8-10/h3-6,9-10,20-22H,7-8H2,1-2H3
48 atoms
S  -0.881673 2.098491 -0.818605
O  -3.083056 -0.738356 0.587282
O  -1.067185 3.097323 0.208488
O  -0.425583 2.45875 -2.137786
O  0.224886 -0.498255 -1.769422
O  2.607207 2.218842 3.363482
O  5.525929 -1.258517 2.396537
N  -2.302988 1.292248 -0.948178
N  0.215347 1.054778 -0.11556
N  1.823328 -0.619545 -0.179596
N  2.188349 0.8214 1.607073
N  3.667495 -0.946216 1.109785
C  -2.979322 -2.933399 -0.240461
C  -4.047369 -3.564689 0.635139
C  -2.649432 -3.504323 1.113053
C  -3.024392 -1.463879 -0.396459
C  -3.024473 -0.893928 -1.766893
C  -2.652293 0.440855 -2.015157
C  -3.432644 -1.682373 -2.844201
C  -2.692915 0.940884 -3.310764
C  -3.460151 -1.185479 -4.13391
C  -3.082038 0.129028 -4.362434
C  0.717564 -0.041612 -0.761578
C  2.585663 -0.220506 0.896346
C  2.958189 1.17965 2.629749
C  4.424686 -0.579455 2.133685
C  4.12044 0.500906 2.954438
C  1.418262 2.931159 3.030153
C  5.875705 -2.355645 1.557525
H  -2.662921 -3.511287 -1.097234
H  -4.773711 -2.897509 1.081722
H  -4.448304 -4.510597 0.295755
H  -2.065777 -4.415335 1.112504
H  -2.405503 -2.807069 1.903801
H  -3.753487 -2.700723 -2.673376
H  -2.447242 1.97494 -3.50044
H  -2.641402 0.955513 -0.044319
H  -3.784681 -1.815203 -4.95095
H  -3.10888 0.537537 -5.364078
H  2.17001 -1.434798 -0.667943
H  4.747811 0.792646 3.784045
H  0.533579 2.297276 3.100371
H  1.479161 3.376809 2.036461
H  1.337648 3.72729 3.76554
H  6.809073 -2.743911 1.957143
H  6.03137 -2.041371 0.525277
H  5.120624 -3.141523 1.58323
H  0.701888 1.370518 0.734911
elementType: S O N C H
totalener: -1782.73485641 hartree
nucrepener: 3085.67922395 hartree
electener: -4868.41408036 hartree
oneelecener: -8577.25883815 hartree
twoeener: 3708.84475779 hartree
cpcmener: -0.03899153 hartree
kineticenergy: 1776.15367444 hartree
xcener: -148.042513833587 hartree
chargesum: 0.0000000
charge: 0.895116 -0.465746 -0.506669 -0.475470 -0.453520 -0.289596 -0.291877 -0.204738 -0.214651 -0.139551 -0.432989 -0.427038 -0.092971 -0.126411 -0.148251 0.292588 0.014526 0.125353 -0.149362 -0.192090 -0.187671 -0.100052 0.353322 0.375035 0.420121 0.412830 -0.322383 -0.126086 -0.115925 0.110462 0.097639 0.099368 0.105401 0.088870 0.154837 0.136885 0.195009 0.160295 0.161601 0.189486 0.144263 0.116371 0.109362 0.137894 0.131350 0.113740 0.112684 0.208640
qa: 0.8951 -0.4657 -0.5067 -0.4755 -0.4535 -0.2896 -0.2919 -0.2047 -0.2147 -0.1396 -0.4330 -0.4270 -0.0930 -0.1264 -0.1483 0.2926 0.0145 0.1254 -0.1494 -0.1921 -0.1877 -0.1001 0.3533 0.3750 0.4201 0.4128 -0.3224 -0.1261 -0.1159 0.1105 0.0976 0.0994 0.1054 0.0889 0.1548 0.1369 0.1950 0.1603 0.1616 0.1895 0.1443 0.1164 0.1094 0.1379 0.1313 0.1137 0.1127 0.2086
va: 6.0232 2.0076 1.9909 2.0052 2.0611 2.1397 2.1300 3.0789 3.0747 3.1764 2.9725 2.9671 3.7622 3.9114 3.9309 3.8271 3.6100 3.8229 3.9255 4.0600 3.9351 3.9218 4.4208 4.2428 3.9919 4.0269 3.9285 3.8436 3.8502 1.0077 1.0232 1.0204 1.0153 1.0337 0.9982 1.0279 1.0662 0.9913 0.9881 1.0191 1.0166 0.9907 0.9974 0.9959 0.9935 0.9956 0.9957 1.0649
dispcorr: -0.025252454 hartree
energy: -1782.760108864647
dipole: -2.85083 3.61328 0.76246 -16.30599 13.33668 -2.96931 4.20781 -3.57725 0.63055
magnitude: 3.12982 au
magnitude: 7.95536 debye
