program: Orca
programVersion: 4.2.1
elementType: S O O O O O O N N N N N C C C C C C C C C C C C C C C C C H H H H H H H H H H H H H H H H H H H
charge: 0
multiplicity: 1
keywords: wb97x-d3
keywords: def2-TZVPP
keywords: def2/J RIJCOSX GRIDX6 NOFINALGRIDX
keywords: grid4 nofinalgrid
keywords: scfconv7
keywords: smallprint printgap noloewdin
keywords: NOSOSCF
formula: C17H19N5O6S
InChI: InChI=1S/C17H19N5O6S/c1-27-13-9-14(28-2)19-16(18-13)20-17(24)22-29(25,26)21-12-6-4-3-5-11(12)15(23)10-7-8-10/h3-6,9-10,20-22H,7-8H2,1-2H3
48 atoms
S  -0.860528 2.054339 -0.794452
O  -3.088947 -0.76535 0.585958
O  -1.024255 3.09328 0.196042
O  -0.371414 2.354966 -2.117576
O  0.138418 -0.62533 -1.624907
O  2.707744 2.295941 3.3015
O  5.581295 -1.228932 2.372868
N  -2.30457 1.291489 -0.925651
N  0.187613 0.99633 -0.038956
N  1.768549 -0.705793 -0.06498
N  2.210409 0.81613 1.635195
N  3.667074 -0.975207 1.157111
C  -2.964432 -2.941537 -0.290099
C  -4.012127 -3.608865 0.583157
C  -2.609475 -3.538351 1.044979
C  -3.033365 -1.470114 -0.41219
C  -3.060787 -0.873579 -1.771235
C  -2.677036 0.460078 -2.001482
C  -3.500706 -1.636943 -2.853298
C  -2.727155 0.982157 -3.287619
C  -3.539385 -1.117843 -4.134291
C  -3.140786 0.192897 -4.347611
C  0.659102 -0.135744 -0.646859
C  2.577026 -0.258274 0.957231
C  3.025674 1.222271 2.603385
C  4.469033 -0.56154 2.127729
C  4.201589 0.557825 2.907875
C  1.50769 2.997137 2.984966
C  5.892187 -2.366953 1.573945
H  -2.650507 -3.493839 -1.164498
H  -4.742516 -2.963057 1.053832
H  -4.403039 -4.552801 0.22722
H  -2.01272 -4.440273 1.015766
H  -2.365567 -2.855537 1.848135
H  -3.834884 -2.652884 -2.693486
H  -2.467831 2.015457 -3.463657
H  -2.652655 0.958809 -0.024367
H  -3.887652 -1.728099 -4.95631
H  -3.173295 0.617351 -5.342313
H  2.092077 -1.546084 -0.525945
H  4.865167 0.888198 3.693661
H  0.625203 2.370563 3.118799
H  1.529382 3.397075 1.970381
H  1.45893 3.826181 3.685985
H  5.141131 -3.150335 1.676244
H  6.844959 -2.734489 1.946232
H  5.996315 -2.105073 0.520858
H  0.701258 1.340615 0.784225
elementType: S O N C H
totalener: -1782.73472497 hartree
nucrepener: 3086.81993742 hartree
electener: -4869.55466239 hartree
oneelecener: -8579.60469776 hartree
twoeener: 3710.05003538 hartree
cpcmener: -0.03905585 hartree
kineticenergy: 1776.15748374 hartree
xcener: -148.042600799010 hartree
chargesum: 0.0000000
charge: 0.894928 -0.464942 -0.506202 -0.476766 -0.454637 -0.289498 -0.291720 -0.204928 -0.215339 -0.140709 -0.433585 -0.426469 -0.096072 -0.125852 -0.148927 0.290095 0.019394 0.129294 -0.152059 -0.190833 -0.185130 -0.102646 0.355006 0.374531 0.421261 0.413433 -0.322719 -0.126504 -0.115933 0.111553 0.097802 0.099136 0.105246 0.088253 0.154636 0.135924 0.195413 0.160633 0.161565 0.189532 0.144252 0.117155 0.108808 0.138021 0.113209 0.131161 0.113543 0.207689
qa: 0.8949 -0.4649 -0.5062 -0.4768 -0.4546 -0.2895 -0.2917 -0.2049 -0.2153 -0.1407 -0.4336 -0.4265 -0.0961 -0.1259 -0.1489 0.2901 0.0194 0.1293 -0.1521 -0.1908 -0.1851 -0.1026 0.3550 0.3745 0.4213 0.4134 -0.3227 -0.1265 -0.1159 0.1116 0.0978 0.0991 0.1052 0.0883 0.1546 0.1359 0.1954 0.1606 0.1616 0.1895 0.1443 0.1172 0.1088 0.1380 0.1132 0.1312 0.1135 0.2077
va: 6.0226 2.0068 1.9918 2.0024 2.0610 2.1398 2.1301 3.0812 3.0757 3.1768 2.9724 2.9666 3.7631 3.9133 3.9323 3.8283 3.5943 3.8210 3.9263 4.0652 3.9340 3.9230 4.4204 4.2438 3.9906 4.0265 3.9294 3.8434 3.8501 1.0075 1.0230 1.0204 1.0152 1.0339 0.9981 1.0279 1.0627 0.9911 0.9883 1.0190 1.0166 0.9903 0.9981 0.9959 0.9956 0.9935 0.9957 1.0654
dispcorr: -0.025394594 hartree
energy: -1782.760119559915
dipole: -2.75518 3.50284 0.74765 -15.98028 13.10995 -2.87034 3.81132 -3.20420 0.60712
magnitude: 3.02761 au
magnitude: 7.69557 debye
