program: Orca
programVersion: 4.2.1
elementType: S O O O O O O N N N N N C C C C C C C C C C C C C C C C C H H H H H H H H H H H H H H H H H H H
charge: 0
multiplicity: 1
keywords: wb97x-d3
keywords: def2-TZVPP
keywords: def2/J RIJCOSX GRIDX6 NOFINALGRIDX
keywords: grid4 nofinalgrid
keywords: scfconv7
keywords: smallprint printgap noloewdin
keywords: NOSOSCF
formula: C17H19N5O6S
InChI: InChI=1S/C17H19N5O6S/c1-27-13-9-14(28-2)19-16(18-13)20-17(24)22-29(25,26)21-12-6-4-3-5-11(12)15(23)10-7-8-10/h3-6,9-10,20-22H,7-8H2,1-2H3
48 atoms
S  -1.558814 1.60137 0.825879
O  -2.384498 -2.093072 0.18019
O  -1.62249 1.769446 2.259455
O  -1.610668 2.7383 -0.060573
O  -0.30235 0.427595 -1.605805
O  6.133994 -0.147014 0.435519
O  3.003047 0.811452 3.724563
N  -2.75145 0.558937 0.406683
N  -0.108408 0.796649 0.62366
N  1.720111 0.135992 -0.649239
N  3.921843 -0.01673 -0.107899
N  2.336081 0.480533 1.565407
C  -1.951167 -2.972161 -1.955268
C  -2.33555 -4.416839 -1.689472
C  -0.953114 -3.965464 -1.425342
C  -2.489637 -1.954198 -1.029648
C  -3.177322 -0.770839 -1.604902
C  -3.271727 0.441244 -0.900347
C  -3.767191 -0.858256 -2.865189
C  -3.932117 1.522369 -1.467954
C  -4.418791 0.222512 -3.432065
C  -4.490182 1.416713 -2.731779
C  0.383758 0.459733 -0.607777
C  2.69414 0.206355 0.322693
C  4.881776 0.050104 0.803037
C  3.308701 0.540513 2.469785
C  4.63734 0.328198 2.143284
C  6.418637 -0.390525 -0.939391
C  1.641108 1.051813 4.06917
H  -1.847589 -2.688504 -2.99306
H  -2.98728 -4.60377 -0.845498
H  -2.532742 -5.028235 -2.55997
H  -0.173648 -4.265459 -2.112771
H  -0.63662 -3.852375 -0.396832
H  -3.731502 -1.791425 -3.410615
H  -4.03397 2.44493 -0.915392
H  -2.679573 -0.333309 0.896072
H  -4.871656 0.129988 -4.40974
H  -5.001342 2.269368 -3.158601
H  2.055279 -0.114308 -1.570192
H  5.428332 0.382455 2.876866
H  5.942187 -1.303854 -1.295623
H  7.498036 -0.50274 -0.999163
H  6.110651 0.444346 -1.569413
H  1.6372 1.229828 5.141315
H  1.009761 0.189206 3.853578
H  1.248001 1.935368 3.564963
H  0.547744 0.793635 1.415854
elementType: S O N C H
totalener: -1782.73457797 hartree
nucrepener: 3096.32338700 hartree
electener: -4879.05796497 hartree
oneelecener: -8598.63677669 hartree
twoeener: 3719.57881173 hartree
cpcmener: -0.03909018 hartree
kineticenergy: 1776.16364004 hartree
xcener: -148.042856719645 hartree
chargesum: 0.0000000
charge: 0.892847 -0.466173 -0.505423 -0.477012 -0.455391 -0.292087 -0.289709 -0.205385 -0.213238 -0.139301 -0.427442 -0.434554 -0.099157 -0.126038 -0.149498 0.287858 0.013236 0.145413 -0.152587 -0.191343 -0.180954 -0.103125 0.353387 0.376508 0.413397 0.420908 -0.323674 -0.116667 -0.126768 0.112070 0.096969 0.099578 0.104808 0.087327 0.154616 0.135461 0.193631 0.160627 0.161154 0.189381 0.144661 0.113364 0.131660 0.113698 0.138021 0.116299 0.110529 0.208117
qa: 0.8928 -0.4662 -0.5054 -0.4770 -0.4554 -0.2921 -0.2897 -0.2054 -0.2132 -0.1393 -0.4274 -0.4346 -0.0992 -0.1260 -0.1495 0.2879 0.0132 0.1454 -0.1526 -0.1913 -0.1810 -0.1031 0.3534 0.3765 0.4134 0.4209 -0.3237 -0.1167 -0.1268 0.1121 0.0970 0.0996 0.1048 0.0873 0.1546 0.1355 0.1936 0.1606 0.1612 0.1894 0.1447 0.1134 0.1317 0.1137 0.1380 0.1163 0.1105 0.2081
va: 6.0229 2.0029 1.9934 2.0006 2.0594 2.1302 2.1395 3.0799 3.0795 3.1753 2.9664 2.9710 3.7604 3.9168 3.9324 3.8273 3.5836 3.8003 3.9255 4.0746 3.9360 3.9226 4.4209 4.2402 4.0264 3.9912 3.9295 3.8495 3.8432 1.0078 1.0237 1.0203 1.0150 1.0341 0.9979 1.0265 1.0582 0.9911 0.9884 1.0195 1.0165 0.9953 0.9934 0.9959 0.9958 0.9907 0.9972 1.0629
dispcorr: -0.025744811 hartree
energy: -1782.760322777863
dipole: 3.16190 -1.57992 1.58198 -14.20465 12.16741 -2.03723 -7.58083 6.11609 -1.46474
magnitude: 2.96622 au
magnitude: 7.53953 debye
