program: Orca
programVersion: 4.2.1
elementType: S O O O O O O N N N N N C C C C C C C C C C C C C C C C C H H H H H H H H H H H H H H H H H H H
charge: 0
multiplicity: 1
keywords: wb97x-d3
keywords: def2-TZVPP
keywords: def2/J RIJCOSX GRIDX6 NOFINALGRIDX
keywords: grid4 nofinalgrid
keywords: scfconv7
keywords: smallprint printgap noloewdin
keywords: NOSOSCF
formula: C17H19N5O6S
InChI: InChI=1S/C17H19N5O6S/c1-27-13-9-14(28-2)19-16(18-13)20-17(24)22-29(25,26)21-12-6-4-3-5-11(12)15(23)10-7-8-10/h3-6,9-10,20-22H,7-8H2,1-2H3
48 atoms
S  -0.82722 2.05226 -0.871148
O  -2.925435 -0.801109 0.602414
O  -0.888683 3.180318 0.029336
O  -0.376747 2.214929 -2.231676
O  -0.027266 -0.760343 -1.479481
O  2.793746 2.393951 3.147442
O  5.425182 -1.378221 2.509971
N  -2.31425 1.360369 -0.895308
N  0.17975 0.998735 -0.059119
N  1.623646 -0.815894 0.059644
N  2.191086 0.815384 1.613161
N  3.517269 -1.106032 1.288341
C  -2.648982 -2.908829 -0.403069
C  -3.495977 -3.730801 0.552064
C  -2.062744 -3.514288 0.84464
C  -2.885325 -1.450723 -0.431631
C  -3.093001 -0.798508 -1.751012
C  -2.780625 0.555226 -1.95736
C  -3.621308 -1.531344 -2.812209
C  -2.978272 1.130323 -3.205429
C  -3.818309 -0.955763 -4.055597
C  -3.482652 0.374902 -4.251708
C  0.54956 -0.219527 -0.561487
C  2.475502 -0.337799 1.032057
C  3.037169 1.246414 2.543224
C  4.354771 -0.66371 2.215711
C  4.167577 0.531662 2.901073
C  1.638659 3.141055 2.769972
C  5.658407 -2.592638 1.801737
H  -2.387429 -3.380337 -1.340103
H  -4.229073 -3.196601 1.14335
H  -3.81973 -4.699017 0.194343
H  -1.376009 -4.33678 0.694854
H  -1.798234 -2.839233 1.648039
H  -3.897674 -2.566903 -2.665358
H  -2.759432 2.177761 -3.356708
H  -2.607558 1.028662 0.023489
H  -4.234615 -1.541736 -4.863673
H  -3.631517 0.838202 -5.218166
H  1.878056 -1.716532 -0.32469
H  4.857493 0.880819 3.655401
H  1.685158 3.454951 1.726056
H  1.642072 4.025886 3.400987
H  0.718808 2.582951 2.950252
H  4.858775 -3.315468 1.963721
H  6.587395 -2.990728 2.201736
H  5.774547 -2.419598 0.731584
H  0.73644 1.372779 0.723367
elementType: S O N C H
totalener: -1782.73458872 hartree
nucrepener: 3106.19303705 hartree
electener: -4888.92762577 hartree
oneelecener: -8618.35684330 hartree
twoeener: 3729.42921753 hartree
cpcmener: -0.03915954 hartree
kineticenergy: 1776.15112100 hartree
xcener: -148.040557906729 hartree
chargesum: 0.0000000
charge: 0.892276 -0.465121 -0.505897 -0.477631 -0.452874 -0.289503 -0.291568 -0.210872 -0.211493 -0.137427 -0.431210 -0.426295 -0.099821 -0.126734 -0.149652 0.285594 0.018144 0.144671 -0.154602 -0.186918 -0.179859 -0.105775 0.349603 0.374249 0.420166 0.414044 -0.322621 -0.126110 -0.115912 0.110943 0.096706 0.099642 0.104441 0.085602 0.155336 0.136516 0.194639 0.160421 0.161389 0.189575 0.144566 0.109503 0.138217 0.116376 0.113155 0.131480 0.113413 0.207226
qa: 0.8923 -0.4651 -0.5059 -0.4776 -0.4529 -0.2895 -0.2916 -0.2109 -0.2115 -0.1374 -0.4312 -0.4263 -0.0998 -0.1267 -0.1497 0.2856 0.0181 0.1447 -0.1546 -0.1869 -0.1799 -0.1058 0.3496 0.3742 0.4202 0.4140 -0.3226 -0.1261 -0.1159 0.1109 0.0967 0.0996 0.1044 0.0856 0.1553 0.1365 0.1946 0.1604 0.1614 0.1896 0.1446 0.1095 0.1382 0.1164 0.1132 0.1315 0.1134 0.2072
va: 6.0231 2.0034 1.9937 1.9997 2.0610 2.1408 2.1303 3.0793 3.0793 3.1742 2.9747 2.9667 3.7557 3.9202 3.9339 3.8398 3.5700 3.8028 3.9252 4.0742 3.9332 3.9236 4.4231 4.2421 3.9926 4.0257 3.9297 3.8419 3.8501 1.0090 1.0237 1.0202 1.0150 1.0345 0.9974 1.0243 1.0545 0.9912 0.9884 1.0190 1.0164 0.9979 0.9959 0.9908 0.9956 0.9934 0.9957 1.0675
dispcorr: -0.026183267 hartree
energy: -1782.760771984303
dipole: -1.78167 2.54810 0.76642 -15.73456 12.99007 -2.74448 3.69264 -3.00459 0.68805
magnitude: 2.93138 au
magnitude: 7.45098 debye
