program: Orca
programVersion: 4.2.1
elementType: S O O O O O O N N N N N C C C C C C C C C C C C C C C C C H H H H H H H H H H H H H H H H H H H
charge: 0
multiplicity: 1
keywords: wb97x-d3
keywords: def2-TZVPP
keywords: def2/J RIJCOSX GRIDX6 NOFINALGRIDX
keywords: grid4 nofinalgrid
keywords: scfconv7
keywords: smallprint printgap noloewdin
keywords: NOSOSCF
formula: C17H19N5O6S
InChI: InChI=1S/C17H19N5O6S/c1-27-13-9-14(28-2)19-16(18-13)20-17(24)22-29(25,26)21-12-6-4-3-5-11(12)15(23)10-7-8-10/h3-6,9-10,20-22H,7-8H2,1-2H3
48 atoms
S  -1.096661 2.097448 -0.291589
O  -1.670603 -1.039649 -2.424474
O  -1.740009 2.451394 0.949699
O  -0.430828 3.092204 -1.100452
O  -1.129729 -0.553172 1.072964
O  4.361836 2.074258 -0.486199
O  5.466355 -1.426309 2.353472
N  -2.200033 1.349057 -1.243895
N  0.129862 0.999551 0.000789
N  1.115839 -0.728686 1.200426
N  2.73057 0.698557 0.328722
N  3.287498 -1.085354 1.767367
C  -2.226389 -2.953828 -1.178167
C  -0.895612 -3.612782 -1.436753
C  -2.047452 -3.96786 -2.291681
C  -2.386057 -1.538611 -1.570029
C  -3.445044 -0.738029 -0.901444
C  -3.319412 0.650388 -0.737073
C  -4.600493 -1.363737 -0.437769
C  -4.325835 1.368463 -0.10652
C  -5.603771 -0.645367 0.190255
C  -5.457326 0.721823 0.365084
C  -0.039806 -0.112692 0.7786
C  2.434193 -0.343786 1.086187
C  4.013704 1.03864 0.253512
C  4.562708 -0.734323 1.684735
C  5.004775 0.34334 0.925818
C  3.350683 2.805517 -1.175091
C  5.037707 -2.514605 3.167003
H  -2.766784 -3.286688 -0.303457
H  -0.111954 -2.996642 -1.858307
H  -0.566305 -4.3246 -0.691647
H  -2.530594 -4.925593 -2.150855
H  -2.071578 -3.591097 -3.306368
H  -4.72914 -2.428768 -0.577904
H  -4.237335 2.440657 -0.002596
H  -1.784268 0.92706 -2.071785
H  -6.493839 -1.15119 0.539078
H  -6.233896 1.295609 0.853209
H  0.961711 -1.55035 1.77018
H  6.04681 0.622088 0.867987
H  2.648483 3.272822 -0.483489
H  2.81167 2.179224 -1.886858
H  3.874374 3.585998 -1.720865
H  4.563085 -3.298635 2.576767
H  4.351408 -2.188963 3.948979
H  5.94023 -2.909801 3.626039
H  1.094089 1.299283 -0.196513
elementType: S O N C H
totalener: -1782.73434708 hartree
nucrepener: 3111.04963392 hartree
electener: -4893.78398100 hartree
oneelecener: -8628.08862530 hartree
twoeener: 3734.30464430 hartree
cpcmener: -0.03943941 hartree
kineticenergy: 1776.15392147 hartree
xcener: -148.040416193394 hartree
chargesum: -0.0000000
charge: 0.890431 -0.465819 -0.476622 -0.505629 -0.454601 -0.289369 -0.292098 -0.207582 -0.209276 -0.136500 -0.435319 -0.427610 -0.093064 -0.151447 -0.130507 0.283844 0.001304 0.155194 -0.152346 -0.182342 -0.176168 -0.105690 0.347431 0.377795 0.418904 0.412137 -0.320927 -0.124673 -0.116328 0.110336 0.086541 0.104422 0.100949 0.094845 0.155056 0.136511 0.192135 0.161163 0.160912 0.189386 0.144972 0.108813 0.116600 0.137392 0.113146 0.113544 0.131631 0.208524
qa: 0.8904 -0.4658 -0.4766 -0.5056 -0.4546 -0.2894 -0.2921 -0.2076 -0.2093 -0.1365 -0.4353 -0.4276 -0.0931 -0.1514 -0.1305 0.2838 0.0013 0.1552 -0.1523 -0.1823 -0.1762 -0.1057 0.3474 0.3778 0.4189 0.4121 -0.3209 -0.1247 -0.1163 0.1103 0.0865 0.1044 0.1009 0.0948 0.1551 0.1365 0.1921 0.1612 0.1609 0.1894 0.1450 0.1088 0.1166 0.1374 0.1131 0.1135 0.1316 0.2085
va: 6.0244 2.0045 2.0004 1.9940 2.0581 2.1399 2.1301 3.0797 3.0834 3.1719 2.9715 2.9666 3.7374 3.9341 3.9204 3.8497 3.5840 3.7781 3.9238 4.0772 3.9316 3.9225 4.4247 4.2365 3.9946 4.0285 3.9299 3.8431 3.8495 1.0091 1.0334 1.0154 1.0200 1.0253 0.9970 1.0237 1.0506 0.9906 0.9888 1.0196 1.0163 0.9979 0.9907 0.9958 0.9955 0.9956 0.9935 1.0627
dispcorr: -0.026378495 hartree
energy: -1782.760725578416
dipole: 1.07052 -0.18051 0.89001 -16.03190 13.31665 -2.71526 -1.29860 1.75966 0.46106
magnitude: 2.89436 au
magnitude: 7.35688 debye
