program: Orca
programVersion: 4.2.1
elementType: S O O O O O O N N N N N C C C C C C C C C C C C C C C C C H H H H H H H H H H H H H H H H H H H
charge: 0
multiplicity: 1
keywords: wb97x-d3
keywords: def2-TZVPP
keywords: def2/J RIJCOSX GRIDX6 NOFINALGRIDX
keywords: grid4 nofinalgrid
keywords: scfconv7
keywords: smallprint printgap noloewdin
keywords: NOSOSCF
formula: C17H19N5O6S
InChI: InChI=1S/C17H19N5O6S/c1-27-13-9-14(28-2)19-16(18-13)20-17(24)22-29(25,26)21-12-6-4-3-5-11(12)15(23)10-7-8-10/h3-6,9-10,20-22H,7-8H2,1-2H3
48 atoms
S  -0.840646 2.089508 -0.917206
O  -2.734993 -0.849366 0.633459
O  -0.841162 3.2341 -0.035003
O  -0.480294 2.222414 -2.307056
O  -0.045357 -0.718905 -1.546899
O  2.815084 2.36415 3.111148
O  5.251724 -1.555458 2.613187
N  -2.326393 1.400917 -0.837298
N  0.210535 1.04953 -0.146663
N  1.588284 -0.811429 0.008029
N  2.183623 0.805575 1.566994
N  3.413701 -1.189361 1.311572
C  -2.391627 -2.886977 -0.488553
C  -2.971718 -3.793639 0.579546
C  -1.534135 -3.451358 0.61487
C  -2.739646 -1.452701 -0.428243
C  -3.104115 -0.763621 -1.694041
C  -2.867541 0.608084 -1.874772
C  -3.704711 -1.479316 -2.72791
C  -3.207104 1.219329 -3.073591
C  -4.046654 -0.866782 -3.921669
C  -3.783643 0.482948 -4.096313
C  0.541296 -0.185911 -0.630443
C  2.426428 -0.367727 1.008029
C  3.016286 1.198989 2.525573
C  4.237778 -0.784322 2.267447
C  4.09163 0.427984 2.932722
C  1.714258 3.167036 2.692059
C  5.436726 -2.795494 1.936248
H  -2.257921 -3.319394 -1.470134
H  -3.628951 -3.33575 1.308046
H  -3.267326 -4.783724 0.258817
H  -0.815742 -4.204607 0.319308
H  -1.186792 -2.763105 1.374583
H  -3.92338 -2.530738 -2.597452
H  -3.041932 2.279894 -3.202171
H  -2.560849 1.075432 0.098805
H  -4.517024 -1.440544 -4.708639
H  -4.044892 0.974454 -5.024086
H  1.818143 -1.722049 -0.367744
H  4.770471 0.747615 3.709873
H  1.74461 4.056124 3.316423
H  0.761323 2.659982 2.847322
H  1.809132 3.468523 1.648099
H  6.328887 -3.23706 2.372773
H  5.59436 -2.652676 0.866988
H  4.592574 -3.468426 2.087769
H  0.768649 1.41805 0.636449
elementType: S O N C H
totalener: -1782.73456710 hartree
nucrepener: 3121.50097836 hartree
electener: -4904.23554545 hartree
oneelecener: -8648.93483475 hartree
twoeener: 3744.69928930 hartree
cpcmener: -0.03959930 hartree
kineticenergy: 1776.15676732 hartree
xcener: -148.041968008592 hartree
chargesum: -0.0000000
charge: 0.888963 -0.464671 -0.506138 -0.476979 -0.450819 -0.289438 -0.291515 -0.208168 -0.204431 -0.131856 -0.432260 -0.427563 -0.087415 -0.131104 -0.156256 0.285111 -0.000688 0.149755 -0.150941 -0.184250 -0.174987 -0.103504 0.337543 0.377635 0.418166 0.412329 -0.321339 -0.126608 -0.115646 0.108927 0.095119 0.100985 0.104043 0.085812 0.155655 0.136932 0.191637 0.160280 0.161816 0.189103 0.144785 0.138099 0.114984 0.111382 0.131757 0.112820 0.113266 0.209672
qa: 0.8890 -0.4647 -0.5061 -0.4770 -0.4508 -0.2894 -0.2915 -0.2082 -0.2044 -0.1319 -0.4323 -0.4276 -0.0874 -0.1311 -0.1563 0.2851 -0.0007 0.1498 -0.1509 -0.1842 -0.1750 -0.1035 0.3375 0.3776 0.4182 0.4123 -0.3213 -0.1266 -0.1156 0.1089 0.0951 0.1010 0.1040 0.0858 0.1557 0.1369 0.1916 0.1603 0.1618 0.1891 0.1448 0.1381 0.1150 0.1114 0.1318 0.1128 0.1133 0.2097
va: 6.0275 2.0065 1.9937 2.0007 2.0613 2.1404 2.1304 3.0779 3.0831 3.1724 2.9747 2.9661 3.7289 3.9216 3.9354 3.8645 3.5787 3.7931 3.9198 4.0806 3.9301 3.9210 4.4362 4.2346 3.9950 4.0292 3.9292 3.8423 3.8502 1.0096 1.0255 1.0201 1.0153 1.0337 0.9969 1.0222 1.0502 0.9912 0.9882 1.0193 1.0163 0.9960 0.9917 0.9963 0.9933 0.9959 0.9955 1.0644
dispcorr: -0.026805089 hartree
energy: -1782.761372186171
dipole: -0.86753 1.60907 0.74154 -15.80963 13.10724 -2.70239 3.85868 -3.11191 0.74678
magnitude: 2.90008 au
magnitude: 7.37142 debye
