program: Gaussian 09
title: 000074045
version: EM64L-G09RevD.01
frameworkgroup: C1[X(C13H19N3O3S)]
method: RPBEPBE
basis: SDD
operation: Freq
keyword: #p
keyword: freq=noraman
keyword: PBEPBE/SDD
title: #p freq=noraman PBEPBE/SDD
converged: NO YES NO NO
title: Mulliken charges:
elementType: S O O O N N N C C C C C C C C C C C C C H H H H H H H H H H H H H H H H H H H
charge: 1.006226 -0.258625 -0.487722 -0.552436 -0.002099 -0.386850 -0.684599 -0.401284 -0.387639 -0.385033 -0.373695 -0.378357 0.408814 -0.051562 -0.175313 -0.261016 0.453665 -0.380989 -0.366752 -0.800346 0.190019 0.220145 0.220920 0.199438 0.198016 0.218630 0.246766 0.172425 0.171604 0.236630 0.264504 0.338454 0.305363 0.290592 0.245057 0.243387 0.231643 0.243350 0.228667
chargesum: 0.00000
title: Mulliken charges with hydrogens summed into heavy atoms:
elementType: S O O O N N N C C C C C C C C C C C C C
charge: 1.006226 -0.258625 -0.487722 -0.552436 -0.002099 -0.122346 -0.346146 0.008881 0.032719 0.031613 0.045497 0.029878 0.408814 -0.051562 0.130049 0.029576 0.453665 -0.135931 -0.123365 -0.096686
polarizability: 2.41591843e+02 1.88331550e+01 1.96404447e+02 -1.35333999e+01 1.23284056e+01 1.64765435e+02
1716.lowfreq: -18.2233 -8.9326 -0.0020 -0.0012 -0.0011 3.1632 5.9105 15.3221 22.4286
frequency: -7.3056 13.2938 20.0086 30.6645 39.5357 57.4699 80.3224 98.1356 119.0359 133.9654 153.4432 188.7929 211.7542 225.4590 228.6418 245.3139 288.6765 309.5107 325.0965 346.5585 375.5882 382.3273 386.0673 389.7314 405.2683 418.5031 446.1400 456.1165 504.4105 514.3528 549.3059 584.6057 621.3820 666.8999 688.6545 704.6242 733.9510 775.7333 792.2862 803.6596 812.3125 820.6257 841.3912 853.6689 861.0131 911.9065 951.7745 954.9202 962.5867 968.7877 978.6305 990.4795 991.9766 1015.4186 1046.4285 1049.0573 1051.0668 1075.9093 1089.8876 1115.8775 1121.2201 1132.0576 1150.9801 1183.6362 1187.5100 1218.3349 1238.9723 1260.5081 1266.5754 1281.2588 1300.3237 1312.3569 1328.8263 1341.3834 1345.7381 1351.8269 1360.1990 1383.4815 1393.4838 1398.2431 1452.6426 1461.7896 1463.2082 1466.4831 1471.0635 1472.1407 1474.9846 1475.9392 1492.6022 1593.3470 1595.5891 1637.9436 2835.6515 2850.8200 2970.2852 2980.3720 2994.4445 2995.6825 3040.7098 3053.8444 3057.9455 3062.4873 3063.1190 3067.8511 3093.1457 3136.5950 3141.6351 3163.8888 3186.2974 3358.8704 3497.3106
redmass: 3.7788 1.3533 1.8794 5.1438 4.1244 4.9366 6.6145 4.9116 7.1972 6.7419 5.1489 4.8382 4.2578 1.8325 8.3064 7.5744 5.1963 3.4968 2.5522 1.3737 4.6901 2.1133 3.8176 2.8586 2.8498 8.4107 2.6112 3.6056 2.6715 1.5411 2.3285 5.0215 6.9192 4.3888 7.6929 3.1712 6.7276 5.0077 4.1118 1.4413 4.4345 1.7383 1.2615 2.6864 1.4785 2.2568 1.3808 7.6762 1.3150 4.6081 1.3805 3.0590 1.8570 2.7522 1.9890 1.5940 2.4134 1.3966 2.2394 2.7143 1.3052 2.0720 1.2641 2.3602 1.1479 3.0566 2.1449 1.2785 1.2369 1.3848 1.2567 1.8404 1.2751 1.3953 1.4585 1.4380 1.3914 7.9311 2.6920 1.2199 1.0891 1.1588 1.0915 1.0809 1.1298 2.1688 1.0729 1.1512 1.3619 6.0333 6.9887 8.7253 1.0712 1.0700 1.0639 1.0391 1.0615 1.0606 1.0960 1.0966 1.0954 1.0982 1.0945 1.0950 1.1001 1.0892 1.0906 1.0958 1.0952 1.0754 1.0786
irintensity: 1.1555 1.6277 0.1490 0.0004 0.5425 2.1557 2.6019 7.9028 2.8775 3.1649 0.7662 0.8428 8.2742 1.0899 9.6819 3.9769 9.9361 5.0804 1.4524 4.0330 13.4129 2.5628 2.8643 17.6895 0.1369 53.0452 19.5857 46.3565 50.1671 155.5232 57.5100 30.4385 0.6974 116.3219 45.8336 4.2158 33.1933 14.0336 6.2292 0.0465 133.2470 20.0134 10.0602 5.5391 4.4400 6.4314 1.4953 62.0854 5.7493 14.2341 1.3186 4.1433 3.7794 83.6104 5.4976 23.1271 24.8641 3.7789 103.4734 3.2226 9.0359 140.6116 3.6235 15.7037 8.5503 3.2897 4.5891 2.5263 11.4543 28.1810 3.5881 321.5746 3.8106 0.6340 5.0874 0.8750 10.3664 1.6626 12.3852 16.0452 7.9592 13.1734 10.8479 0.9902 19.1734 24.9091 14.1610 40.1284 102.4650 16.1365 0.5388 168.6434 57.3640 148.6738 42.4555 24.6471 24.7390 35.7440 61.9720 49.8894 0.6776 43.8619 19.0370 48.0522 15.0740 12.8887 9.1359 6.4627 7.6960 64.3964 28.8551
temp: 298.150 k
press: 1.00000 atm
elementType: 16 8 8 8 7 7 7 6 6 6 6 6 6 6 6 6 6 6 6 6 1 1 1 1 1 1 1 1 1 1 1 1 1 1 1 1 1 1 1
symmnumber: 1
zpe: 812411.6 jmol-1
zpe.correction: 0.309431 hartree
zpe.thermalcorrener: 0.329669 hartree
zpe.thermalcorrenthalpy: 0.330614 hartree
zpe.thermalcorrgfe: 0.257493 hartree
zpe.sumelectzpe: -1293.053610 hartree
zpe.sumelectthermal: -1293.033372 hartree
zpe.sumelectthermalent: -1293.032428 hartree
zpe.sumelectthermalfe: -1293.105548 hartree
dipole: -2.5481 4.0449 -3.5472
dipole: 5.9528
quadrupole: -97.2358 -131.8464 -125.9747
quadrupole: 21.9736 1.3529 5.7277
quadrupole: 21.1165 -13.4941 -7.6224 21.9736 1.3529 5.7277
hfenergy: -1293.3630416 hartree
pointgroup: C01 [X(C13H19N3O3S1)]
dipole: -0.9674444 -1.8811503 1.0051926 debye
polarizability: 242.3488836|-20.4637843|188.698104|8.283663|18.2750707|171.7147365 unknown
InChI: InChI=1S/C13H19N3O3S/c1-11-5-7-12(8-6-11)20(18,19)15-13(17)14-16-9-3-2-4-10-16/h5-8,14-15H,2-4,9-10H2,1H3
charge 0 multiplicity 1
39 atoms
S  1.638975 1.982516 0.500228
O  -0.560819 0.13238 -0.768787
O  1.422272 2.814962 -0.867394
O  2.216805 2.701253 1.842522
N  -3.206118 -0.132233 0.304679
N  -2.191937 0.68515 0.853607
N  0.01893 1.370508 1.13183
C  -5.857736 -1.289082 -0.089771
C  -5.2496 -0.283723 -1.09458
C  -4.732836 -2.058769 0.639799
C  -4.253949 0.663642 -0.393308
C  -3.74714 -1.082041 1.312961
C  -0.901848 0.68578 0.308633
C  2.650944 0.431188 0.159865
C  2.484611 -0.233964 -1.063911
C  3.566906 0.043427 1.150186
C  4.241254 -1.809302 -0.332667
C  3.296664 -1.364961 -1.296549
C  4.362265 -1.093575 0.888107
C  5.123889 -3.011396 -0.613641
H  -6.475623 -0.743387 0.653539
H  -6.530486 -1.994632 -0.611825
H  -4.711843 -0.83263 -1.890465
H  -6.041652 0.318869 -1.578036
H  -5.151806 -2.737723 1.406586
H  -4.174206 -2.676521 -0.088615
H  -3.747063 1.313767 -1.125967
H  -4.807881 1.317235 0.330249
H  -4.274675 -0.535178 2.138983
H  -2.895103 -1.62702 1.754284
H  -2.423132 1.323208 1.630678
H  -0.200068 1.782218 2.0465
H  1.736297 0.102489 -1.785551
H  3.66017 0.618093 2.077215
H  3.18674 -1.91375 -2.238553
H  5.087107 -1.425127 1.640313
H  4.621674 -3.736781 -1.276724
H  6.060749 -2.701036 -1.115774
H  5.407772 -3.533855 0.316258
