program: Orca
programVersion: 4.2.1
elementType: S O O O O O O N N N N N C C C C C C C C C C C C C C C C C H H H H H H H H H H H H H H H H H H H
charge: 0
multiplicity: 1
keywords: wb97x-d3
keywords: def2-TZVPP
keywords: def2/J RIJCOSX GRIDX6 NOFINALGRIDX
keywords: grid4 nofinalgrid
keywords: scfconv7
keywords: smallprint printgap noloewdin
keywords: NOSOSCF
formula: C17H19N5O6S
InChI: InChI=1S/C17H19N5O6S/c1-27-13-9-14(28-2)19-16(18-13)20-17(24)22-29(25,26)21-12-6-4-3-5-11(12)15(23)10-7-8-10/h3-6,9-10,20-22H,7-8H2,1-2H3
48 atoms
S  -1.128302 2.137813 -0.341347
O  -1.411478 -0.993062 -2.493488
O  -1.877603 2.495553 0.836727
O  -0.403165 3.130161 -1.100022
O  -1.252936 -0.485222 1.070231
O  4.349125 2.056856 -0.21664
O  5.274331 -1.569484 2.527191
N  -2.140982 1.376222 -1.382634
N  0.077622 1.050426 0.061382
N  0.981603 -0.715139 1.271138
N  2.6582 0.696157 0.495938
N  3.124001 -1.14845 1.890417
C  -1.958922 -2.914597 -1.258037
C  -0.546199 -3.44714 -1.286619
C  -1.511076 -3.916131 -2.302317
C  -2.167762 -1.51824 -1.690992
C  -3.316972 -0.764899 -1.124559
C  -3.265904 0.628857 -0.962164
C  -4.475353 -1.439015 -0.744414
C  -4.347195 1.304362 -0.415058
C  -5.554537 -0.762502 -0.200955
C  -5.482325 0.610508 -0.026266
C  -0.144449 -0.065219 0.819088
C  2.311967 -0.362349 1.208517
C  3.951134 1.005653 0.474444
C  4.409529 -0.82904 1.859034
C  4.902207 0.263053 1.153817
C  3.380707 2.833061 -0.917358
C  4.794791 -2.68248 3.275971
H  -2.593368 -3.287437 -0.466802
H  0.233681 -2.763192 -1.595844
H  -0.274827 -4.11583 -0.480736
H  -1.91889 -4.91452 -2.21624
H  -1.407009 -3.552661 -3.316785
H  -4.546114 -2.50955 -0.883786
H  -4.311096 2.379645 -0.311111
H  -1.647711 0.969396 -2.175175
H  -6.445427 -1.305806 0.083489
H  -6.318025 1.151127 0.397787
H  0.787458 -1.538724 1.825402
H  5.952242 0.516168 1.138469
H  2.656634 3.285107 -0.238311
H  2.863207 2.244873 -1.676067
H  3.940053 3.62488 -1.40868
H  4.09053 -2.376475 4.049844
H  5.672494 -3.119873 3.744802
H  4.322248 -3.427422 2.635466
H  1.052835 1.336555 -0.095082
elementType: S O N C H
totalener: -1782.73418303 hartree
nucrepener: 3125.84423869 hartree
electener: -4908.57842172 hartree
oneelecener: -8657.56623574 hartree
twoeener: 3748.98781402 hartree
cpcmener: -0.03946439 hartree
kineticenergy: 1776.15646324 hartree
xcener: -148.040627983835 hartree
chargesum: -0.0000000
charge: 0.889870 -0.464284 -0.475071 -0.505476 -0.449082 -0.289479 -0.292013 -0.208663 -0.203002 -0.131474 -0.436328 -0.428349 -0.082038 -0.155528 -0.133598 0.279589 0.000212 0.156196 -0.152962 -0.183377 -0.172887 -0.105911 0.330320 0.380726 0.417541 0.411288 -0.321139 -0.125194 -0.116227 0.107328 0.086572 0.105103 0.102325 0.093793 0.154492 0.137181 0.192304 0.160740 0.160830 0.188825 0.145042 0.109152 0.116675 0.137483 0.113434 0.131456 0.113184 0.210422
qa: 0.8899 -0.4643 -0.4751 -0.5055 -0.4491 -0.2895 -0.2920 -0.2087 -0.2030 -0.1315 -0.4363 -0.4283 -0.0820 -0.1555 -0.1336 0.2796 0.0002 0.1562 -0.1530 -0.1834 -0.1729 -0.1059 0.3303 0.3807 0.4175 0.4113 -0.3211 -0.1252 -0.1162 0.1073 0.0866 0.1051 0.1023 0.0938 0.1545 0.1372 0.1923 0.1607 0.1608 0.1888 0.1450 0.1092 0.1167 0.1375 0.1134 0.1315 0.1132 0.2104
va: 6.0232 2.0082 2.0036 1.9941 2.0618 2.1398 2.1304 3.0798 3.0824 3.1688 2.9709 2.9666 3.7212 3.9301 3.9220 3.8607 3.5913 3.7717 3.9262 4.0817 3.9280 3.9210 4.4382 4.2277 3.9969 4.0294 3.9285 3.8431 3.8497 1.0114 1.0332 1.0157 1.0199 1.0266 0.9972 1.0231 1.0501 0.9907 0.9888 1.0198 1.0164 0.9972 0.9909 0.9958 0.9956 0.9936 0.9955 1.0604
dispcorr: -0.026900518 hartree
energy: -1782.761083546302
dipole: 2.17871 -1.24241 0.93630 -16.22830 13.41641 -2.81188 -1.11250 1.59034 0.47784
magnitude: 3.00195 au
magnitude: 7.63035 debye
