program: Orca
programVersion: 4.2.1
elementType: S O O O O O O N N N N N C C C C C C C C C C C C C C C C C H H H H H H H H H H H H H H H H H H H
charge: 0
multiplicity: 1
keywords: wb97x-d3
keywords: def2-TZVPP
keywords: def2/J RIJCOSX GRIDX6 NOFINALGRIDX
keywords: grid4 nofinalgrid
keywords: scfconv7
keywords: smallprint printgap noloewdin
keywords: NOSOSCF
formula: C17H19N5O6S
InChI: InChI=1S/C17H19N5O6S/c1-27-13-9-14(28-2)19-16(18-13)20-17(24)22-29(25,26)21-12-6-4-3-5-11(12)15(23)10-7-8-10/h3-6,9-10,20-22H,7-8H2,1-2H3
48 atoms
S  -2.152451 2.243242 0.369346
O  -2.995524 -1.472907 -0.706545
O  -3.403989 2.292452 1.077601
O  -1.523416 3.451369 -0.109768
O  -2.18425 -0.182077 2.156113
O  3.101363 2.176705 -0.292489
O  3.921677 -2.336635 0.400088
N  -2.373917 1.199542 -0.901958
N  -0.958454 1.542443 1.308107
N  0.032852 -0.487171 1.888147
N  1.57161 0.890711 0.817125
N  1.981483 -1.406664 1.162214
C  -1.209723 -2.885644 -0.118356
C  -1.984587 -4.183289 -0.2191
C  -1.930363 -3.475249 1.074381
C  -1.793311 -1.677524 -0.735393
C  -0.882399 -0.701428 -1.394918
C  -1.22101 0.660267 -1.521414
C  0.31109 -1.144823 -1.964893
C  -0.380088 1.518497 -2.218844
C  1.156172 -0.280314 -2.638988
C  0.805076 1.053679 -2.766763
C  -1.116203 0.267043 1.812669
C  1.252766 -0.311088 1.263145
C  2.736731 1.002839 0.1856
C  3.145888 -1.277698 0.54124
C  3.59336 -0.072006 0.015686
C  2.275936 3.313036 -0.054985
C  3.472241 -3.592022 0.901577
H  -0.131833 -2.966483 -0.10374
H  -2.909624 -4.157514 -0.780735
H  -1.39592 -5.081415 -0.350269
H  -1.299989 -3.875886 1.857759
H  -2.814428 -2.956052 1.418769
H  0.578534 -2.191041 -1.907076
H  -0.659459 2.554222 -2.3488
H  -3.10728 0.516791 -0.71962
H  2.074187 -0.651621 -3.072893
H  1.445756 1.738417 -3.306197
H  -0.111889 -1.413341 2.268624
H  4.541765 0.021727 -0.492932
H  2.143553 3.499395 1.011332
H  1.300701 3.217665 -0.532833
H  2.800191 4.155154 -0.4990
H  2.546274 -3.910278 0.421526
H  3.325748 -3.568757 1.981548
H  4.259697 -4.301913 0.662417
H  0.005575 1.796287 1.046971
elementType: S O N C H
totalener: -1782.72688089 hartree
nucrepener: 3370.38723379 hartree
electener: -5153.11411469 hartree
oneelecener: -9144.60415880 hartree
twoeener: 3991.49004412 hartree
cpcmener: -0.04193520 hartree
kineticenergy: 1776.15868657 hartree
xcener: -148.041815038144 hartree
chargesum: -0.0000000
charge: 0.863487 -0.450045 -0.470264 -0.489012 -0.400306 -0.287144 -0.290023 -0.216311 -0.167810 -0.136016 -0.395403 -0.395227 -0.105872 -0.137102 -0.151128 0.335881 0.025978 0.068607 -0.152983 -0.213990 -0.163977 -0.094952 0.239572 0.307203 0.407872 0.420767 -0.322809 -0.116256 -0.117390 0.090572 0.096279 0.104352 0.109262 0.094864 0.153082 0.160550 0.206237 0.157951 0.164276 0.199157 0.139992 0.127624 0.094265 0.139593 0.110866 0.114432 0.134076 0.207221
qa: 0.8635 -0.4500 -0.4703 -0.4890 -0.4003 -0.2871 -0.2900 -0.2163 -0.1678 -0.1360 -0.3954 -0.3952 -0.1059 -0.1371 -0.1511 0.3359 0.0260 0.0686 -0.1530 -0.2140 -0.1640 -0.0950 0.2396 0.3072 0.4079 0.4208 -0.3228 -0.1163 -0.1174 0.0906 0.0963 0.1044 0.1093 0.0949 0.1531 0.1605 0.2062 0.1580 0.1643 0.1992 0.1400 0.1276 0.0943 0.1396 0.1109 0.1144 0.1341 0.2072
va: 6.0238 2.0290 2.0271 1.9956 2.1064 2.1235 2.1320 3.0173 3.0639 3.1668 2.9459 2.9263 3.7269 3.9458 3.9165 3.7664 3.4642 3.8491 3.8508 3.9932 3.8781 3.8012 4.5489 4.2848 3.9584 3.9961 3.9283 3.8431 3.8597 1.0080 1.0276 1.0192 1.0148 1.0393 0.9953 1.0174 1.0489 0.9923 0.9880 1.0093 1.0196 0.9916 0.9917 0.9953 0.9867 0.9951 0.9941 1.0765
dispcorr: -0.036907851 hartree
energy: -1782.763788742035
dipole: 11.96879 -7.30679 4.66201 -16.47941 13.87340 -2.60601 -3.79694 2.67572 -1.12122
magnitude: 5.45736 au
magnitude: 13.87150 debye
