program: Orca
programVersion: 4.2.1
elementType: S O O O O O O N N N N N C C C C C C C C C C C C C C C C C H H H H H H H H H H H H H H H H H H H
charge: 0
multiplicity: 1
keywords: wb97x-d3
keywords: def2-TZVPP
keywords: def2/J RIJCOSX GRIDX6 NOFINALGRIDX
keywords: grid4 nofinalgrid
keywords: scfconv7
keywords: smallprint printgap noloewdin
keywords: NOSOSCF
formula: C17H19N5O6S
InChI: InChI=1S/C17H19N5O6S/c1-27-13-9-14(28-2)19-16(18-13)20-17(24)22-29(25,26)21-12-6-4-3-5-11(12)15(23)10-7-8-10/h3-6,9-10,20-22H,7-8H2,1-2H3
48 atoms
S  -2.04144 2.339874 -0.381711
O  -2.211539 -1.302645 0.222508
O  -3.185267 2.830056 0.339627
O  -1.297331 3.170037 -1.297974
O  -2.212144 1.102303 2.415644
O  3.719931 -2.103794 2.520367
O  2.923576 0.642489 -1.136682
N  -2.543127 0.998494 -1.210058
N  -0.879073 1.823157 0.700684
N  -0.063503 0.426056 2.364752
N  1.847655 -0.802183 2.467131
N  1.450432 0.592993 0.608459
C  -0.220631 -2.538522 0.062762
C  -0.776913 -3.938256 0.277559
C  -0.382023 -3.114591 1.440437
C  -1.188594 -1.522475 -0.405053
C  -0.919901 -0.819781 -1.690502
C  -1.606289 0.353373 -2.059204
C  -0.008253 -1.363291 -2.598323
C  -1.372784 0.933477 -3.299515
C  0.229234 -0.773629 -3.82743
C  -0.458451 0.377548 -4.179065
C  -1.143399 1.117524 1.85287
C  1.133485 0.071264 1.782227
C  2.966487 -1.219339 1.894065
C  2.574507 0.163735 0.042129
C  3.392175 -0.776976 0.645163
C  3.303458 -2.585166 3.795309
C  2.117615 1.649196 -1.742878
H  0.78707 -2.487822 -0.326397
H  -1.831559 -4.08188 0.079814
H  -0.141636 -4.75913 -0.027523
H  0.533977 -3.368802 1.955923
H  -1.158149 -2.699975 2.069861
H  0.514281 -2.278475 -2.357474
H  -1.926706 1.817182 -3.583856
H  -3.064168 0.36221 -0.608314
H  0.938633 -1.220366 -4.510522
H  -0.293411 0.841801 -5.142358
H  -0.252051 -0.027937 3.249167
H  4.302648 -1.131064 0.184467
H  4.060512 -3.303929 4.09781
H  2.336354 -3.085699 3.743283
H  3.252598 -1.784485 4.533245
H  2.105083 2.564009 -1.148674
H  1.097508 1.307792 -1.913458
H  2.580123 1.858592 -2.703636
H  0.066127 1.6973 0.309991
elementType: S O N C H
totalener: -1782.72831181 hartree
nucrepener: 3337.03587607 hartree
electener: -5119.76418788 hartree
oneelecener: -9078.27111748 hartree
twoeener: 3958.50692960 hartree
cpcmener: -0.04474714 hartree
kineticenergy: 1776.15063905 hartree
xcener: -148.040506672742 hartree
chargesum: 0.0000000
charge: 0.870031 -0.440271 -0.468879 -0.484976 -0.428891 -0.288047 -0.286413 -0.209374 -0.198331 -0.131330 -0.403665 -0.402535 -0.079522 -0.117742 -0.163888 0.288560 -0.042626 0.112464 -0.164417 -0.145017 -0.164473 -0.098166 0.310055 0.320125 0.410898 0.401163 -0.327530 -0.115081 -0.075670 0.104963 0.100847 0.100127 0.109052 0.092852 0.156821 0.135223 0.194660 0.160103 0.161107 0.191119 0.142104 0.132677 0.108104 0.116341 0.142768 0.026164 0.142806 0.205709
qa: 0.8700 -0.4403 -0.4689 -0.4850 -0.4289 -0.2880 -0.2864 -0.2094 -0.1983 -0.1313 -0.4037 -0.4025 -0.0795 -0.1177 -0.1639 0.2886 -0.0426 0.1125 -0.1644 -0.1450 -0.1645 -0.0982 0.3101 0.3201 0.4109 0.4012 -0.3275 -0.1151 -0.0757 0.1050 0.1008 0.1001 0.1091 0.0929 0.1568 0.1352 0.1947 0.1601 0.1611 0.1911 0.1421 0.1327 0.1081 0.1163 0.1428 0.0262 0.1428 0.2057
va: 6.0410 2.0336 2.0303 1.9992 2.0824 2.1301 2.1309 3.0330 3.0718 3.1644 2.9351 2.9451 3.6955 3.9521 3.9463 3.8177 3.4717 3.8271 3.8737 4.0004 3.9049 3.9059 4.4702 4.2757 4.0144 3.9747 3.9216 3.8550 3.8420 1.0074 1.0244 1.0213 1.0107 1.0356 1.0000 1.0257 1.0456 0.9920 0.9895 1.0171 1.0186 0.9935 0.9903 0.9949 0.9966 0.9930 0.9966 1.0813
dispcorr: -0.035486375 hartree
energy: -1782.763798185709
dipole: 13.00826 -9.01704 3.99122 -18.50482 15.14183 -3.36299 -2.20529 0.90976 -1.29553
magnitude: 5.37754 au
magnitude: 13.66862 debye
