program: Orca
programVersion: 4.2.1
elementType: S O O O O O O N N N N N C C C C C C C C C C C C C C C C C H H H H H H H H H H H H H H H H H H H
charge: 0
multiplicity: 1
keywords: wb97x-d3
keywords: def2-TZVPP
keywords: def2/J RIJCOSX GRIDX6 NOFINALGRIDX
keywords: grid4 nofinalgrid
keywords: scfconv7
keywords: smallprint printgap noloewdin
keywords: NOSOSCF
formula: C17H19N5O6S
InChI: InChI=1S/C17H19N5O6S/c1-27-13-9-14(28-2)19-16(18-13)20-17(24)22-29(25,26)21-12-6-4-3-5-11(12)15(23)10-7-8-10/h3-6,9-10,20-22H,7-8H2,1-2H3
48 atoms
S  -1.406494 1.525356 0.560837
O  -4.029429 -1.383646 -0.005422
O  -2.026454 1.574988 1.862162
O  -1.119105 2.748433 -0.154958
O  -0.665609 -1.191146 1.497678
O  3.789659 3.065707 0.32885
O  6.039009 -0.50818 2.256855
N  -2.351745 0.532531 -0.320828
N  0.077226 0.779718 0.642415
N  1.557627 -0.794198 1.490374
N  2.661761 1.15783 0.878189
N  3.797079 -0.65929 1.86095
C  -4.887488 -2.636858 -1.783192
C  -6.163904 -2.926814 -1.036357
C  -5.090378 -3.942513 -1.036709
C  -3.939382 -1.666619 -1.195936
C  -2.8858 -1.060759 -2.046271
C  -2.099135 0.025745 -1.591549
C  -2.62633 -1.579051 -3.318171
C  -1.124229 0.565061 -2.429317
C  -1.641147 -1.058459 -4.132867
C  -0.898587 0.022029 -3.6813
C  0.251379 -0.446402 1.233047
C  2.718152 -0.056294 1.399235
C  3.798892 1.84521 0.830232
C  4.924807 0.034767 1.803403
C  4.996851 1.324981 1.289409
C  2.557558 3.61499 -0.131539
C  5.991856 -1.822753 2.80474
H  -4.949138 -2.69455 -2.859471
H  -6.347247 -2.371925 -0.125703
H  -7.03897 -3.100855 -1.64843
H  -5.20473 -4.829275 -1.645904
H  -4.515021 -4.083931 -0.130677
H  -3.192159 -2.424917 -3.680193
H  -0.536003 1.417923 -2.126417
H  -2.989032 -0.057226 0.231328
H  -1.458501 -1.486827 -5.108441
H  -0.131568 0.456372 -4.308794
H  1.669575 -1.714223 1.896098
H  5.920814 1.883756 1.255173
H  2.795245 4.615477 -0.483059
H  1.823782 3.691619 0.671748
H  2.144311 3.040071 -0.961428
H  5.329251 -1.877484 3.668789
H  7.008205 -2.044831 3.119756
H  5.677174 -2.558122 2.063958
H  0.92017 1.35776 0.507442
elementType: S O N C H
totalener: -1782.73798032 hartree
nucrepener: 3042.49258863 hartree
electener: -4825.23056895 hartree
oneelecener: -8490.43619001 hartree
twoeener: 3665.20562106 hartree
cpcmener: -0.04165771 hartree
kineticenergy: 1776.15291073 hartree
xcener: -148.049622605036 hartree
chargesum: -0.0000000
charge: 0.871869 -0.453598 -0.486204 -0.497982 -0.453082 -0.289717 -0.291179 -0.162475 -0.229184 -0.142380 -0.430760 -0.425118 -0.085462 -0.147257 -0.135670 0.326251 -0.052682 0.138026 -0.113949 -0.223003 -0.215638 -0.090778 0.369161 0.370356 0.421699 0.415148 -0.323601 -0.123766 -0.116620 0.104022 0.091237 0.104927 0.100717 0.099007 0.149952 0.130949 0.208236 0.159896 0.163293 0.189399 0.145157 0.138780 0.111013 0.112632 0.113268 0.131977 0.113596 0.209540
qa: 0.8719 -0.4536 -0.4862 -0.4980 -0.4531 -0.2897 -0.2912 -0.1625 -0.2292 -0.1424 -0.4308 -0.4251 -0.0855 -0.1473 -0.1357 0.3263 -0.0527 0.1380 -0.1139 -0.2230 -0.2156 -0.0908 0.3692 0.3704 0.4217 0.4151 -0.3236 -0.1238 -0.1166 0.1040 0.0912 0.1049 0.1007 0.0990 0.1500 0.1309 0.2082 0.1599 0.1633 0.1894 0.1452 0.1388 0.1110 0.1126 0.1133 0.1320 0.1136 0.2095
va: 6.0386 2.0358 2.0112 1.9795 2.0689 2.1413 2.1310 3.1262 3.0634 3.1787 2.9743 2.9664 3.7634 3.9244 3.9060 3.8539 3.6861 3.9396 3.8893 3.9736 3.9649 3.9551 4.4177 4.2529 3.9896 4.0251 3.9287 3.8483 3.8496 1.0125 1.0326 1.0159 1.0196 1.0240 1.0027 1.0342 1.0796 0.9915 0.9874 1.0184 1.0163 0.9957 0.9957 0.9908 0.9959 0.9932 0.9955 1.0697
dispcorr: -0.024428019 hartree
energy: -1782.762408336019
dipole: -2.38142 4.63509 2.25367 -12.04582 10.26403 -1.78180 -9.31759 6.89044 -2.42714
magnitude: 3.76097 au
magnitude: 9.55962 debye
