program: Orca
programVersion: 4.2.1
elementType: S O O O O O O N N N N N C C C C C C C C C C C C C C C C C H H H H H H H H H H H H H H H H H H H
charge: 0
multiplicity: 1
keywords: wb97x-d3
keywords: def2-TZVPP
keywords: def2/J RIJCOSX GRIDX6 NOFINALGRIDX
keywords: grid4 nofinalgrid
keywords: scfconv7
keywords: smallprint printgap noloewdin
keywords: NOSOSCF
formula: C17H19N5O6S
InChI: InChI=1S/C17H19N5O6S/c1-27-13-9-14(28-2)19-16(18-13)20-17(24)22-29(25,26)21-12-6-4-3-5-11(12)15(23)10-7-8-10/h3-6,9-10,20-22H,7-8H2,1-2H3
48 atoms
S  -1.625793 0.174166 0.771496
O  -3.302182 -2.940146 -1.604253
O  -1.556737 -1.257751 0.599783
O  -2.237197 0.772307 1.931849
O  -0.409623 2.871418 0.662612
O  3.264061 -2.167138 1.367448
O  6.083864 1.459107 2.03342
N  -2.386066 0.81841 -0.532303
N  -0.024628 0.63582 0.682304
N  1.708762 2.151975 0.970336
N  2.468829 -0.037685 1.151151
N  3.895246 1.808692 1.490649
C  -4.577123 -1.127563 -0.793779
C  -4.875607 -1.653211 0.590947
C  -5.796245 -1.973507 -0.521755
C  -3.454393 -1.737388 -1.538783
C  -2.537273 -0.841575 -2.312504
C  -2.052715 0.379138 -1.837332
C  -2.161277 -1.254803 -3.588933
C  -1.245158 1.177376 -2.637575
C  -1.374205 -0.450116 -4.395373
C  -0.921892 0.773156 -3.921998
C  0.365627 1.943091 0.770753
C  2.729567 1.256826 1.212997
C  3.476709 -0.865707 1.407839
C  4.892542 0.97231 1.740985
C  4.74683 -0.410145 1.71786
C  1.955494 -2.645952 1.066349
C  6.258605 2.872158 2.083107
H  -4.74203 -0.071319 -0.951163
H  -4.232169 -2.438469 0.965057
H  -5.174874 -0.921438 1.329378
H  -6.74897 -1.463071 -0.569455
H  -5.800393 -2.983412 -0.910702
H  -2.517866 -2.204041 -3.966606
H  -0.872709 2.118393 -2.252268
H  -2.547955 1.816106 -0.431544
H  -1.11636 -0.776668 -5.393553
H  -0.306041 1.407704 -4.545042
H  1.978171 3.12633 1.012071
H  5.565896 -1.081923 1.9286
H  2.028787 -3.729922 1.082244
H  1.626592 -2.330739 0.075715
H  1.229397 -2.333443 1.817676
H  6.068721 3.336992 1.115814
H  7.298765 3.028751 2.356539
H  5.617615 3.332185 2.834939
H  0.702006 -0.086606 0.781651
elementType: S O N C H
totalener: -1782.73433075 hartree
nucrepener: 3099.53961778 hartree
electener: -4882.27394853 hartree
oneelecener: -8604.18675368 hartree
twoeener: 3721.91280515 hartree
cpcmener: -0.04316297 hartree
kineticenergy: 1776.16681790 hartree
xcener: -148.038832088407 hartree
chargesum: -0.0000000
charge: 0.894066 -0.442006 -0.491433 -0.486504 -0.474836 -0.289238 -0.291726 -0.215851 -0.201690 -0.141418 -0.433461 -0.426553 -0.080188 -0.134359 -0.160339 0.241283 0.003797 0.164439 -0.112145 -0.215754 -0.176760 -0.093533 0.364182 0.373306 0.422953 0.414591 -0.323343 -0.125905 -0.115843 0.106615 0.090811 0.096117 0.103613 0.090134 0.143119 0.143094 0.189578 0.161333 0.162169 0.189813 0.144893 0.138398 0.115367 0.111244 0.113293 0.131604 0.113566 0.209510
qa: 0.8941 -0.4420 -0.4914 -0.4865 -0.4748 -0.2892 -0.2917 -0.2159 -0.2017 -0.1414 -0.4335 -0.4266 -0.0802 -0.1344 -0.1603 0.2413 0.0038 0.1644 -0.1121 -0.2158 -0.1768 -0.0935 0.3642 0.3733 0.4230 0.4146 -0.3233 -0.1259 -0.1158 0.1066 0.0908 0.0961 0.1036 0.0901 0.1431 0.1431 0.1896 0.1613 0.1622 0.1898 0.1449 0.1384 0.1154 0.1112 0.1133 0.1316 0.1136 0.2095
va: 5.9826 2.0412 1.9972 2.0155 2.0334 2.1407 2.1313 3.0610 3.1132 3.1838 2.9753 2.9684 3.6580 3.9155 3.9516 3.8798 3.6849 3.7294 3.9320 4.0285 3.9467 3.9111 4.4143 4.2498 3.9888 4.0271 3.9297 3.8426 3.8493 1.0159 1.0315 1.0217 1.0162 1.0304 1.0126 1.0185 1.0224 0.9902 0.9891 1.0187 1.0166 0.9959 0.9911 0.9963 0.9957 0.9936 0.9956 1.0682
dispcorr: -0.026900727 hartree
energy: -1782.761231480584
dipole: -1.70947 4.08878 2.37931 -2.76240 4.55329 1.79088 -4.35021 3.16158 -1.18863
magnitude: 3.20644 au
magnitude: 8.15012 debye
