program: Orca
programVersion: 4.2.1
elementType: S O O O O O O N N N N N C C C C C C C C C C C C C C C C C H H H H H H H H H H H H H H H H H H H
charge: 0
multiplicity: 1
keywords: wb97x-d3
keywords: def2-TZVPP
keywords: def2/J RIJCOSX GRIDX6 NOFINALGRIDX
keywords: grid4 nofinalgrid
keywords: scfconv7
keywords: smallprint printgap noloewdin
keywords: NOSOSCF
formula: C17H19N5O6S
InChI: InChI=1S/C17H19N5O6S/c1-27-13-9-14(28-2)19-16(18-13)20-17(24)22-29(25,26)21-12-6-4-3-5-11(12)15(23)10-7-8-10/h3-6,9-10,20-22H,7-8H2,1-2H3
48 atoms
S  -1.481671 1.685233 0.552247
O  -4.025995 -1.237689 -0.005727
O  -2.13899 1.745728 1.835443
O  -1.132731 2.906841 -0.139283
O  -0.857628 -1.080488 1.43638
O  3.790424 3.000516 0.387486
O  5.890526 -0.77424 2.087686
N  -2.433716 0.730409 -0.367735
N  -0.02688 0.889742 0.664723
N  1.380676 -0.780402 1.448361
N  2.573051 1.135819 0.892186
N  3.633059 -0.78401 1.757347
C  -4.485774 -2.888412 -1.591341
C  -5.731201 -3.318863 -0.862591
C  -4.481213 -4.079096 -0.649898
C  -3.781116 -1.674585 -1.126037
C  -2.769103 -1.023116 -1.994443
C  -2.098419 0.158355 -1.592853
C  -2.430609 -1.58244 -3.230693
C  -1.146991 0.731709 -2.434587
C  -1.475572 -1.019917 -4.053107
C  -0.838048 0.142515 -3.646858
C  0.091384 -0.365044 1.205413
C  2.576804 -0.102841 1.355629
C  3.74556 1.760411 0.836518
C  4.795678 -0.151022 1.694357
C  4.925349 1.154687 1.233353
C  2.578208 3.637743 -0.007283
C  5.785839 -2.108014 2.578367
H  -4.452074 -3.127866 -2.642899
H  -6.089694 -2.684018 -0.063253
H  -6.505891 -3.762295 -1.474115
H  -4.371924 -5.052227 -1.109721
H  -3.959631 -3.959554 0.291193
H  -2.913185 -2.488615 -3.56409
H  -0.651065 1.652502 -2.16621
H  -3.096855 0.152771 0.170068
H  -1.23524 -1.48091 -5.000936
H  -0.094522 0.607007 -4.281006
H  1.451174 -1.720648 1.815055
H  5.87838 1.661605 1.191084
H  1.874186 3.716677 0.822079
H  2.108056 3.126629 -0.848617
H  2.861347 4.639008 -0.320777
H  5.154153 -2.163427 3.465212
H  6.798281 -2.402999 2.842007
H  5.399932 -2.78903 1.819548
H  0.839813 1.435661 0.548427
elementType: S O N C H
totalener: -1782.73738491 hartree
nucrepener: 3062.87018786 hartree
electener: -4845.60757277 hartree
oneelecener: -8531.21005822 hartree
twoeener: 3685.60248545 hartree
cpcmener: -0.04138461 hartree
kineticenergy: 1776.15418409 hartree
xcener: -148.049353441138 hartree
chargesum: -0.0000000
charge: 0.872610 -0.447772 -0.487625 -0.498654 -0.452345 -0.289328 -0.291340 -0.173188 -0.220897 -0.141546 -0.431912 -0.425832 -0.083753 -0.143096 -0.143227 0.337290 -0.056142 0.117842 -0.121828 -0.227540 -0.204158 -0.089603 0.366850 0.371966 0.421727 0.416083 -0.324608 -0.124048 -0.116980 0.107274 0.091173 0.104057 0.102504 0.097416 0.148970 0.145236 0.206044 0.160217 0.163653 0.189412 0.145347 0.112395 0.111019 0.138804 0.113674 0.131939 0.113554 0.208365
qa: 0.8726 -0.4478 -0.4876 -0.4987 -0.4523 -0.2893 -0.2913 -0.1732 -0.2209 -0.1415 -0.4319 -0.4258 -0.0838 -0.1431 -0.1432 0.3373 -0.0561 0.1178 -0.1218 -0.2275 -0.2042 -0.0896 0.3669 0.3720 0.4217 0.4161 -0.3246 -0.1240 -0.1170 0.1073 0.0912 0.1041 0.1025 0.0974 0.1490 0.1452 0.2060 0.1602 0.1637 0.1894 0.1453 0.1124 0.1110 0.1388 0.1137 0.1319 0.1136 0.2084
va: 6.0314 2.0466 2.0093 1.9769 2.0701 2.1413 2.1312 3.1140 3.0601 3.1782 2.9729 2.9667 3.7573 3.9151 3.9095 3.8640 3.6816 3.9478 3.8876 3.9814 3.9632 3.9512 4.4180 4.2510 3.9888 4.0241 3.9283 3.8488 3.8496 1.0145 1.0325 1.0164 1.0184 1.0244 1.0075 1.0282 1.0866 0.9913 0.9877 1.0186 1.0163 0.9948 0.9913 0.9956 0.9958 0.9932 0.9955 1.0708
dispcorr: -0.024783159 hartree
energy: -1782.762168067878
dipole: -0.45675 2.98612 2.52937 -13.71261 11.56989 -2.14272 -8.43179 6.11128 -2.32051
magnitude: 4.04645 au
magnitude: 10.28525 debye
