program: Orca
programVersion: 4.2.1
elementType: S O O O O O O N N N N N C C C C C C C C C C C C C C C C C H H H H H H H H H H H H H H H H H H H
charge: 0
multiplicity: 1
keywords: wb97x-d3
keywords: def2-TZVPP
keywords: def2/J RIJCOSX GRIDX6 NOFINALGRIDX
keywords: grid4 nofinalgrid
keywords: scfconv7
keywords: smallprint printgap noloewdin
keywords: NOSOSCF
formula: C17H19N5O6S
InChI: InChI=1S/C17H19N5O6S/c1-27-13-9-14(28-2)19-16(18-13)20-17(24)22-29(25,26)21-12-6-4-3-5-11(12)15(23)10-7-8-10/h3-6,9-10,20-22H,7-8H2,1-2H3
48 atoms
S  -0.902321 2.102669 -0.906056
O  -2.863061 -0.874892 0.574537
O  -0.96533 3.19915 0.027778
O  -0.493622 2.282511 -2.271618
O  -0.082871 -0.777344 -1.458203
O  2.795678 2.471057 3.103269
O  5.230054 -1.461561 2.692528
N  -2.36693 1.351647 -0.899183
N  0.148503 1.051317 -0.119607
N  1.566452 -0.777529 0.078715
N  2.162175 0.879442 1.595485
N  3.394548 -1.121873 1.383005
C  -2.472534 -2.92748 -0.504047
C  -3.268568 -3.840499 0.406782
C  -1.854206 -3.533162 0.722705
C  -2.807398 -1.481721 -0.479735
C  -3.089942 -0.813871 -1.77518
C  -2.83242 0.552028 -1.962316
C  -3.625658 -1.546712 -2.831301
C  -3.082543 1.138725 -3.195507
C  -3.883769 -0.958128 -4.055411
C  -3.595017 0.385381 -4.237011
C  0.490132 -0.189053 -0.574759
C  2.404172 -0.307068 1.061576
C  2.996133 1.293514 2.543695
C  4.216759 -0.695474 2.329649
C  4.071731 0.530966 2.968532
C  1.69842 3.262414 2.66653
C  5.410402 -2.703942 2.031962
H  -2.161267 -3.333902 -1.456568
H  -4.036495 -3.378631 1.01326
H  -3.523748 -4.819126 0.022732
H  -1.110216 -4.300923 0.558605
H  -1.651574 -2.867661 1.550767
H  -3.857278 -2.594142 -2.688943
H  -2.887596 2.191783 -3.333601
H  -2.627114 0.999104 0.019199
H  -4.305647 -1.54283 -4.86131
H  -3.786213 0.858678 -5.190781
H  1.799904 -1.694883 -0.269843
H  4.750456 0.866551 3.737232
H  0.743372 2.760189 2.824975
H  1.783165 3.534253 1.613635
H  1.73021 4.165238 3.269746
H  6.2840 -3.156626 2.493357
H  5.590969 -2.571209 0.964725
H  4.549684 -3.360699 2.159838
H  0.704758 1.445966 0.645197
totalener: -1782.70530360 hartree
nucrepener: 3110.67963248 hartree
electener: -4893.38493609 hartree
oneelecener: -8626.24504493 hartree
twoeener: 3732.86010885 hartree
kineticenergy: 1776.20846761 hartree
xcener: -148.041605849945 hartree
chargesum: -0.0000000
charge: 0.862456 -0.406070 -0.461962 -0.420692 -0.394041 -0.260984 -0.262991 -0.207575 -0.219140 -0.160784 -0.428860 -0.408444 -0.097815 -0.112525 -0.137292 0.240854 0.043693 0.127267 -0.155989 -0.134710 -0.149168 -0.085885 0.342428 0.367743 0.395906 0.383541 -0.298562 -0.130029 -0.124873 0.098173 0.090227 0.081790 0.081586 0.086059 0.131955 0.118287 0.173577 0.126012 0.128195 0.166137 0.129074 0.109830 0.110812 0.128409 0.124232 0.108850 0.106641 0.194659
qa: 0.8625 -0.4061 -0.4620 -0.4207 -0.3940 -0.2610 -0.2630 -0.2076 -0.2191 -0.1608 -0.4289 -0.4084 -0.0978 -0.1125 -0.1373 0.2409 0.0437 0.1273 -0.1560 -0.1347 -0.1492 -0.0859 0.3424 0.3677 0.3959 0.3835 -0.2986 -0.1300 -0.1249 0.0982 0.0902 0.0818 0.0816 0.0861 0.1320 0.1183 0.1736 0.1260 0.1282 0.1661 0.1291 0.1098 0.1108 0.1284 0.1242 0.1089 0.1066 0.1947
va: 6.0402 2.0585 2.0390 2.0605 2.1147 2.1610 2.1499 3.0949 3.0962 3.1598 2.9733 2.9720 3.7646 3.9229 3.9479 3.9090 3.6020 3.9183 3.9783 4.1194 3.9887 3.9744 4.4011 4.2368 4.0253 4.0601 3.9367 3.8657 3.8769 1.0117 1.0271 1.0214 1.0177 1.0373 1.0023 1.0286 1.0724 1.0023 0.9989 1.0377 1.0217 0.9945 0.9980 0.9960 0.9939 0.9967 0.9972 1.0704
dispcorr: -0.026443605 hartree
energy: -1782.731747209634
dipole: -1.13708 1.86726 0.73018 -15.95999 14.10751 -1.85248 3.52745 -3.01907 0.50838
magnitude: 2.05506 au
magnitude: 5.22356 debye
