program: Gaussian 09
title: 000069039
version: EM64L-G09RevD.01
frameworkgroup: C1[X(C8H6O5)]
method: RPBEPBE
basis: SDD
operation: Freq
keyword: #p
keyword: freq=noraman
keyword: PBEPBE/SDD
title: #p freq=noraman PBEPBE/SDD
converged: YES YES NO NO
title: Mulliken charges:
elementType: O O O O O C C C C C C C C H H H H H H
charge: -0.418736 -0.397362 -0.438529 -0.208308 -0.235916 0.163066 0.141753 0.201954 -0.352244 -0.387684 -0.182408 0.100767 0.123614 0.283237 0.230508 0.237935 0.366294 0.382845 0.389215
chargesum: 0.00000
title: Mulliken charges with hydrogens summed into heavy atoms:
elementType: O O O O O C C C C C C C C
charge: -0.052442 -0.014517 -0.049315 -0.208308 -0.235916 0.163066 0.141753 0.201954 -0.069007 -0.157176 0.055527 0.100767 0.123614
polarizability: 1.27282883e+02 3.53469971e+00 1.27563788e+02 -7.25670523e-01 1.77275364e+00 5.35263419e+01
1716.lowfreq: -0.0009 -0.0006 -0.0006 2.7376 6.6758 10.4021 35.1623 81.4984 106.9355
frequency: 35.1603 81.4941 106.9305 143.5496 156.4626 191.5414 216.2682 298.2267 318.5729 348.5367 371.6441 425.6080 479.9627 499.9518 535.9325 564.4163 588.2003 591.1670 606.8777 657.2146 705.2697 713.2147 752.9122 769.4536 813.2085 901.3025 902.5343 983.5946 1008.2665 1052.5475 1079.8721 1136.8901 1164.5314 1176.3380 1222.5626 1260.2135 1309.1504 1327.4995 1393.0981 1446.0137 1483.0898 1590.8719 1609.0665 1642.7545 1657.7774 3123.8154 3159.3334 3193.4733 3510.2571 3532.3525 3590.2420
redmass: 10.7026 6.6989 9.3143 7.7266 5.7294 6.8458 5.1352 7.9700 1.1359 6.9152 5.0978 5.8251 4.6385 3.4023 3.1647 2.6702 1.9886 3.6310 1.5246 4.5412 5.1659 6.9788 1.7967 6.0670 2.8065 1.4461 7.0814 1.3365 5.8253 2.7042 2.0689 1.5486 1.6566 1.1994 1.6646 2.3761 2.5968 2.8533 8.9960 2.5682 3.4805 7.4622 7.0451 8.9065 9.9703 1.0896 1.0932 1.0957 1.0637 1.0642 1.0663
irintensity: 1.1150 0.4754 3.9731 2.3341 10.9074 1.5496 0.6156 5.4234 131.9250 1.0707 0.4751 10.8391 2.5308 4.3309 34.5552 29.6770 55.3978 115.8362 116.2353 30.1768 50.5502 15.0762 81.8742 9.9190 14.5604 3.7147 137.2593 2.2019 200.5726 93.6348 73.9583 271.5688 95.8723 2.9448 23.8225 63.6565 58.4845 127.0495 19.0050 16.9779 40.1981 63.9284 9.4736 220.2821 236.7185 9.9920 12.1854 2.9832 31.4642 53.4110 51.1319
temp: 298.150 k
press: 1.00000 atm
elementType: 8 8 8 8 8 6 6 6 6 6 6 6 6 1 1 1 1 1 1
symmnumber: 1
zpe: 337521.7 jmol-1
zpe.correction: 0.128555 hartree
zpe.thermalcorrener: 0.140263 hartree
zpe.thermalcorrenthalpy: 0.141207 hartree
zpe.thermalcorrgfe: 0.090337 hartree
zpe.sumelectzpe: -683.642903 hartree
zpe.sumelectthermal: -683.631195 hartree
zpe.sumelectthermalent: -683.630251 hartree
zpe.sumelectthermalfe: -683.681121 hartree
dipole: 1.4518 3.9331 1.3496
dipole: 4.4044
quadrupole: -52.8962 -68.0152 -80.3390
quadrupole: 4.2809 0.5671 -5.9961
quadrupole: 14.1872 -0.9317 -13.2555 4.2809 0.5671 -5.9961
hfenergy: -683.7714579 hartree
pointgroup: C01 [X(C8H6O5)]
dipole: -0.9409292 -1.3817381 0.4561478 debye
dipolederiv: -0.7696144 0.6026555 0.0137122 0.7339157 -0.6766304 0.0186668 0.0272046 0.0046399 -0.387475 -0.3853886 0.0165854 -0.1157887 -0.0053186 -0.5293059 -0.4090907 -0.0853023 -0.4353953 -1.0424669 -0.8709985 0.5257692 -0.0212605 0.6091251 -0.8262618 0.0228605 -0.0233706 0.0180038 -0.4238858 -0.330004 -0.069701 0.0348977 -0.065895 -0.8062287 0.2912184 -0.0424684 0.0204207 -0.8517328 -0.8710075 -0.182599 -0.0145319 -0.1194783 -0.8869562 -0.0008641 -0.0185706 -0.0099923 -0.2893048 -0.0523123 0.3123908 -0.0079419 -0.1878795 -0.1823773 -0.0363938 -0.0024256 0.0185573 -0.1134321 -0.5771612 -0.1650291 -0.0255625 -0.1029517 0.1740163 0.0141791 -0.0155416 -0.0192365 0.0376171 0.6978963 -0.6950923 0.0047316 -0.8058342 0.5060972 -0.004764 -0.0042676 -0.0062899 0.0900704 -0.0542057 -0.1504961 0.001163 0.063371 -0.1929393 0.0015493 -0.0015018 -0.0209162 -0.1436348 -0.0020139 -0.0680161 0.0030798 0.3119381 -0.1270437 0.0047575 0.0076396 -0.0128717 -0.1701534 0.0592572 0.1918758 0.0063256 -0.001003 0.11205 0.0064172 0.0048697 0.0114959 -0.124802 0.4532433 0.1307167 0.0840034 0.2147994 1.3399174 0.0648995 0.1052082 0.3033389 1.6080148 1.8503103 -0.1075363 0.0530274 -0.1856732 1.3954726 -0.018523 0.0493436 0.0059912 0.2337944 0.0814547 0.0577057 -0.001193 0.0533126 0.0414961 -0.0005585 0.001177 0.0003442 0.1718878 -0.1139015 -0.021469 -0.0067309 0.0092228 0.0797404 -0.0006723 -0.0054179 0.0025929 0.1688538 0.0620166 -0.0589693 -0.003356 -0.0650465 -0.0798258 -0.0058072 -0.0039277 -0.0045944 0.156992 0.243196 -0.1369815 -0.0133271 -0.213547 0.2406616 -0.0163531 -0.019613 -0.0071584 0.382943 0.3351023 -0.0777275 0.0115366 -0.0666583 0.1580537 0.0718602 0.0265191 0.1333361 0.2981088 0.2441305 -0.1040818 -0.0027849 -0.1763995 0.2600639 -0.0033819 0.0004453 -0.0022661 0.3986057 unknown
polarizability: 128.82029|3.1725959|125.9554663|3.018003|0.4406639|53.5972566 unknown
InChI: InChI=1S/C8H6O5/c9-5-3-1-2-4(7(10)11)6(5)8(12)13/h1-3,9-10,12H
charge 0 multiplicity 1
19 atoms
O  -2.64461 1.101619 -0.015208
O  0.195635 2.256843 1.290822
O  2.793493 -1.611748 0.108942
O  0.129806 2.466541 -1.025583
O  2.509378 0.689753 0.078062
C  -0.388283 0.310623 0.022121
C  0.54271 -0.763545 0.032439
C  -1.77192 0.007978 -0.020396
C  0.093619 -2.108951 -0.004143
C  -2.223575 -1.332599 -0.054748
C  -1.286126 -2.386761 -0.048352
C  0.023799 1.763603 -0.001562
C  1.999746 -0.455716 0.074754
H  0.833003 -2.912272 0.002505
H  -3.299112 -1.54843 -0.083507
H  -1.637039 -3.423085 -0.076593
H  -3.588881 0.815586 -0.081192
H  0.486779 3.208117 1.24036
H  3.749879 -1.339556 0.130579
