program: Orca
programVersion: 4.2.1
elementType: S O O O O O O N N N N N C C C C C C C C C C C C C C C C C H H H H H H H H H H H H H H H H H H H
charge: 0
multiplicity: 1
keywords: wb97x-d3
keywords: def2-TZVPP
keywords: def2/J RIJCOSX GRIDX6 NOFINALGRIDX
keywords: grid4 nofinalgrid
keywords: scfconv7
keywords: smallprint printgap noloewdin
keywords: NOSOSCF
formula: C17H19N5O6S
InChI: InChI=1S/C17H19N5O6S/c1-27-13-9-14(28-2)19-16(18-13)20-17(24)22-29(25,26)21-12-6-4-3-5-11(12)15(23)10-7-8-10/h3-6,9-10,20-22H,7-8H2,1-2H3
48 atoms
S  -1.117865 2.16723 -0.339797
O  -1.395023 -1.096015 -2.368101
O  -1.887652 2.553621 0.810055
O  -0.376811 3.122135 -1.125812
O  -1.192117 -0.544152 1.040378
O  4.353198 2.151615 -0.232946
O  5.377563 -1.565961 2.353954
N  -2.101116 1.332611 -1.363222
N  0.092195 1.088755 0.105748
N  1.046431 -0.680145 1.269014
N  2.693075 0.766237 0.496489
N  3.207501 -1.126635 1.808771
C  -2.048198 -2.947316 -1.073463
C  -0.719236 -3.625543 -1.247033
C  -1.853756 -4.040405 -2.104419
C  -2.190726 -1.555628 -1.569055
C  -3.337321 -0.756481 -1.068241
C  -3.251342 0.637267 -0.938698
C  -4.524577 -1.392218 -0.714568
C  -4.327545 1.35031 -0.429081
C  -5.600693 -0.678257 -0.220642
C  -5.490152 0.694588 -0.063566
C  -0.111126 -0.058067 0.816558
C  2.369726 -0.319518 1.180651
C  3.983711 1.077466 0.437383
C  4.489933 -0.802377 1.742258
C  4.958887 0.312111 1.055696
C  3.35751 2.938898 -0.873345
C  4.915486 -2.694448 3.07881
H  -2.611104 -3.202397 -0.186113
H  0.073217 -3.044786 -1.699396
H  -0.406179 -4.28525 -0.449007
H  -2.340091 -4.987917 -1.914741
H  -1.842584 -3.737833 -3.143264
H  -4.612423 -2.463711 -0.839074
H  -4.257433 2.423506 -0.332436
H  -1.587643 0.857011 -2.101459
H  -6.516978 -1.188941 0.042022
H  -6.32069 1.265501 0.32931
H  0.874413 -1.526841 1.789661
H  6.006867 0.564665 1.009893
H  3.892953 3.749916 -1.358643
H  2.645726 3.358404 -0.161387
H  2.810639 2.370886 -1.626845
H  5.804797 -3.156863 3.498538
H  4.403832 -3.409197 2.433608
H  4.239364 -2.408095 3.884944
H  1.059551 1.39799 -0.030758
totalener: -1782.70511946 hartree
nucrepener: 3118.46871381 hartree
electener: -4901.17383327 hartree
oneelecener: -8641.78838407 hartree
twoeener: 3740.61455081 hartree
kineticenergy: 1776.20905254 hartree
xcener: -148.041703423937 hartree
chargesum: -0.0000000
charge: 0.862461 -0.404756 -0.420162 -0.462615 -0.391285 -0.261013 -0.263317 -0.206280 -0.216657 -0.158629 -0.429481 -0.409271 -0.094588 -0.142606 -0.111894 0.237321 0.043947 0.126763 -0.155786 -0.134286 -0.149265 -0.084989 0.335874 0.368279 0.396723 0.384471 -0.300069 -0.126990 -0.125810 0.097937 0.086832 0.081795 0.081910 0.089861 0.132093 0.118095 0.172539 0.126549 0.128237 0.166032 0.129460 0.127624 0.109165 0.109965 0.124242 0.107065 0.109122 0.195388
qa: 0.8625 -0.4048 -0.4202 -0.4626 -0.3913 -0.2610 -0.2633 -0.2063 -0.2167 -0.1586 -0.4295 -0.4093 -0.0946 -0.1426 -0.1119 0.2373 0.0439 0.1268 -0.1558 -0.1343 -0.1493 -0.0850 0.3359 0.3683 0.3967 0.3845 -0.3001 -0.1270 -0.1258 0.0979 0.0868 0.0818 0.0819 0.0899 0.1321 0.1181 0.1725 0.1265 0.1282 0.1660 0.1295 0.1276 0.1092 0.1100 0.1242 0.1071 0.1091 0.1954
va: 6.0397 2.0615 2.0617 2.0384 2.1171 2.1615 2.1503 3.0949 3.0977 3.1588 2.9735 2.9727 3.7540 3.9485 3.9228 3.9145 3.6028 3.9164 3.9777 4.1243 3.9886 3.9729 4.4073 4.2350 4.0251 4.0589 3.9358 3.8658 3.8766 1.0121 1.0368 1.0177 1.0216 1.0274 1.0018 1.0286 1.0718 1.0020 0.9991 1.0378 1.0217 0.9959 0.9985 0.9950 0.9941 0.9968 0.9967 1.0697
dispcorr: -0.026709960 hartree
energy: -1782.731829417902
dipole: 1.36397 -0.59749 0.76648 -16.45036 14.56215 -1.88822 -0.96069 1.40586 0.44517
magnitude: 2.08591 au
magnitude: 5.30197 debye
