program: Orca
programVersion: 4.2.1
elementType: S O O O O O O N N N N N C C C C C C C C C C C C C C C C C H H H H H H H H H H H H H H H H H H H
charge: 0
multiplicity: 1
keywords: wb97x-d3
keywords: def2-TZVPP
keywords: def2/J RIJCOSX GRIDX6 NOFINALGRIDX
keywords: grid4 nofinalgrid
keywords: scfconv7
keywords: smallprint printgap noloewdin
keywords: NOSOSCF
formula: C17H19N5O6S
InChI: InChI=1S/C17H19N5O6S/c1-27-13-9-14(28-2)19-16(18-13)20-17(24)22-29(25,26)21-12-6-4-3-5-11(12)15(23)10-7-8-10/h3-6,9-10,20-22H,7-8H2,1-2H3
48 atoms
S  -2.020918 2.190846 0.432927
O  -3.657898 -1.265131 -0.876017
O  -3.203304 2.295494 1.23555
O  -1.364814 3.360528 -0.10261
O  -1.854452 -0.511792 1.767832
O  3.322181 2.642447 0.086224
O  4.603537 -1.801179 0.478505
N  -2.383931 1.131057 -0.795354
N  -0.769902 1.427234 1.25709
N  0.399992 -0.540471 1.691312
N  1.857836 1.095062 0.910714
N  2.501549 -1.168321 1.097621
C  -2.326188 -3.130985 -0.374162
C  -3.447933 -4.136974 -0.505935
C  -3.160621 -3.542827 0.815705
C  -2.549742 -1.764246 -0.899389
C  -1.388871 -1.007079 -1.445859
C  -1.361013 0.401776 -1.418868
C  -0.317599 -1.68391 -2.02609
C  -0.272306 1.075248 -1.96732
C  0.76938 -1.009832 -2.553205
C  0.786874 0.375186 -2.51794
C  -0.830317 0.096634 1.588492
C  1.636113 -0.175118 1.207102
C  3.054573 1.393464 0.416737
C  3.694034 -0.852398 0.616983
C  4.042349 0.438596 0.237228
C  2.331652 3.639481 0.297449
C  4.261005 -3.126338 0.850567
H  -1.316227 -3.515875 -0.398251
H  -4.33459 -3.807308 -1.03063
H  -3.161331 -5.162765 -0.695346
H  -2.663929 -4.145982 1.563517
H  -3.838896 -2.798498 1.208846
H  -0.339781 -2.763885 -2.083583
H  -0.266824 2.155596 -1.97581
H  -3.232036 0.595909 -0.619671
H  1.587896 -1.559486 -2.997153
H  1.623678 0.919884 -2.935307
H  0.320255 -1.521297 1.914688
H  5.016687 0.6830 -0.15687
H  1.429669 3.455626 -0.287015
H  2.781795 4.573114 -0.028243
H  2.058873 3.722283 1.350453
H  4.007432 -3.198382 1.908717
H  5.145041 -3.725545 0.648756
H  3.42266 -3.506701 0.265959
H  0.165023 1.810431 1.087421
totalener: -1782.70250640 hartree
nucrepener: 3278.17519811 hartree
electener: -5060.87770451 hartree
oneelecener: -8960.09152126 hartree
twoeener: 3899.21381676 hartree
kineticenergy: 1776.20119170 hartree
xcener: -148.039227106833 hartree
chargesum: 0.0000000
charge: 0.861814 -0.393620 -0.409751 -0.465027 -0.349279 -0.260761 -0.262839 -0.217257 -0.198874 -0.157434 -0.406856 -0.388670 -0.094901 -0.117614 -0.114196 0.278028 -0.008034 0.130304 -0.142800 -0.241050 -0.142597 -0.087412 0.266026 0.333337 0.391404 0.383740 -0.297882 -0.117747 -0.125318 0.075228 0.093432 0.082248 0.078211 0.100119 0.126203 0.164208 0.206743 0.128015 0.132009 0.167391 0.129105 0.095087 0.129406 0.112318 0.109109 0.124889 0.104148 0.197394
qa: 0.8618 -0.3936 -0.4098 -0.4650 -0.3493 -0.2608 -0.2628 -0.2173 -0.1989 -0.1574 -0.4069 -0.3887 -0.0949 -0.1176 -0.1142 0.2780 -0.0080 0.1303 -0.1428 -0.2410 -0.1426 -0.0874 0.2660 0.3333 0.3914 0.3837 -0.2979 -0.1177 -0.1253 0.0752 0.0934 0.0822 0.0782 0.1001 0.1262 0.1642 0.2067 0.1280 0.1320 0.1674 0.1291 0.0951 0.1294 0.1123 0.1091 0.1249 0.1041 0.1974
va: 6.0172 2.0744 2.1044 2.0157 2.1551 2.1525 2.1492 3.0708 3.0776 3.1644 2.9502 2.9423 3.7520 3.9206 3.9363 3.9014 3.6600 3.8479 3.9691 4.0384 3.9407 3.8930 4.4885 4.2540 4.0048 4.0491 3.9373 3.8641 3.8787 1.0131 1.0314 1.0202 1.0204 1.0377 1.0054 1.0078 1.0555 1.0009 1.0003 1.0357 1.0216 1.0000 0.9966 0.9940 0.9968 0.9945 0.9971 1.0799
dispcorr: -0.032395475 hartree
energy: -1782.734901873946
dipole: 8.31193 -5.44527 2.86666 -16.62237 14.70660 -1.91577 -3.77803 3.25693 -0.52110
magnitude: 3.48704 au
magnitude: 8.86335 debye
