program: Orca
programVersion: 4.2.1
elementType: S O O O O O O N N N N N C C C C C C C C C C C C C C C C C H H H H H H H H H H H H H H H H H H H
charge: 0
multiplicity: 1
keywords: wb97x-d3
keywords: def2-TZVPP
keywords: def2/J RIJCOSX GRIDX6 NOFINALGRIDX
keywords: grid4 nofinalgrid
keywords: scfconv7
keywords: smallprint printgap noloewdin
keywords: NOSOSCF
formula: C17H19N5O6S
InChI: InChI=1S/C17H19N5O6S/c1-27-13-9-14(28-2)19-16(18-13)20-17(24)22-29(25,26)21-12-6-4-3-5-11(12)15(23)10-7-8-10/h3-6,9-10,20-22H,7-8H2,1-2H3
48 atoms
S  -1.624102 1.685811 0.187495
O  -4.044551 -1.45966 0.032207
O  -2.383037 1.985244 1.368116
O  -1.264072 2.718407 -0.756545
O  -0.858861 -0.815662 1.70245
O  5.849904 -0.046002 2.314513
O  3.60951 3.251822 -0.065014
N  -2.431735 0.46145 -0.54858
N  -0.13613 1.03104 0.577257
N  1.35118 -0.356131 1.698585
N  3.596783 -0.204415 2.003839
N  2.464937 1.468767 0.783711
C  -4.314828 -3.396464 -1.234996
C  -5.694382 -3.630173 -0.676132
C  -4.545148 -4.338486 -0.071032
C  -3.654999 -2.10026 -0.931671
C  -2.544215 -1.611085 -1.786873
C  -1.961352 -0.336011 -1.580481
C  -2.033623 -2.410042 -2.813328
C  -0.942276 0.09445 -2.432849
C  -1.002746 -1.993019 -3.628908
C  -0.469281 -0.727964 -3.435828
C  0.030907 -0.085891 1.351897
C  2.513494 0.342245 1.478444
C  4.732332 0.449859 1.814996
C  3.611524 2.117449 0.610049
C  4.813242 1.647547 1.112522
C  5.785809 -1.264289 3.039044
C  2.377161 3.754101 -0.561771
H  -4.112502 -3.864701 -2.186207
H  -6.142777 -2.819544 -0.118577
H  -6.377493 -4.188418 -1.302077
H  -4.413374 -5.394387 -0.265456
H  -4.196862 -4.007979 0.898409
H  -2.440493 -3.396663 -2.975591
H  -0.530393 1.086296 -2.330535
H  -3.121386 -0.007069 0.051265
H  -0.62766 -2.640095 -4.409143
H  0.323348 -0.368217 -4.078731
H  1.462626 -1.197452 2.244184
H  5.744246 2.174478 0.971999
H  6.80554 -1.473293 3.350949
H  5.418986 -2.084002 2.420689
H  5.146558 -1.17931 3.918193
H  1.656753 3.937539 0.236454
H  1.927697 3.082647 -1.294719
H  2.617892 4.696503 -1.045702
H  0.696883 1.585978 0.357538
totalener: -1782.70827234 hartree
nucrepener: 3059.89052464 hartree
electener: -4842.59879698 hartree
oneelecener: -8524.19345923 hartree
twoeener: 3681.59466225 hartree
kineticenergy: 1776.20188129 hartree
xcener: -148.047651656017 hartree
chargesum: -0.0000000
charge: 0.856295 -0.389907 -0.418934 -0.466313 -0.366720 -0.262832 -0.261945 -0.171875 -0.235219 -0.168978 -0.406400 -0.429539 -0.077302 -0.122636 -0.129038 0.297387 -0.058340 0.111830 -0.119038 -0.211783 -0.170948 -0.069264 0.338980 0.364156 0.384895 0.396281 -0.301388 -0.125902 -0.125571 0.082462 0.095230 0.083233 0.082857 0.098055 0.120932 0.134130 0.210488 0.125778 0.128836 0.167773 0.129739 0.124561 0.107761 0.109488 0.112313 0.100809 0.129814 0.195790
qa: 0.8563 -0.3899 -0.4189 -0.4663 -0.3667 -0.2628 -0.2619 -0.1719 -0.2352 -0.1690 -0.4064 -0.4295 -0.0773 -0.1226 -0.1290 0.2974 -0.0583 0.1118 -0.1190 -0.2118 -0.1709 -0.0693 0.3390 0.3642 0.3849 0.3963 -0.3014 -0.1259 -0.1256 0.0825 0.0952 0.0832 0.0829 0.0981 0.1209 0.1341 0.2105 0.1258 0.1288 0.1678 0.1297 0.1246 0.1078 0.1095 0.1123 0.1008 0.1298 0.1958
va: 6.0364 2.0961 2.0886 2.0105 2.1529 2.1508 2.1594 3.1490 3.0673 3.1649 2.9726 2.9704 3.7845 3.9190 3.9158 3.9145 3.7148 4.0304 3.9416 4.0072 4.0189 3.9826 4.4152 4.2476 4.0586 4.0237 3.9350 3.8754 3.8742 1.0163 1.0353 1.0191 1.0196 1.0284 1.0147 1.0382 1.0761 1.0027 0.9990 1.0357 1.0217 0.9937 0.9970 0.9968 0.9960 0.9943 0.9956 1.0744
dispcorr: -0.024730795 hartree
energy: -1782.733003134209
dipole: 0.33616 1.61365 1.94981 -15.00121 13.34690 -1.65431 -5.98067 4.96748 -1.01319
magnitude: 2.75046 au
magnitude: 6.99113 debye
