program: Orca
programVersion: 4.2.1
elementType: S O O O O O O N N N N N C C C C C C C C C C C C C C C C C H H H H H H H H H H H H H H H H H H H
charge: 0
multiplicity: 1
keywords: wb97x-d3
keywords: def2-TZVPP
keywords: def2/J RIJCOSX GRIDX6 NOFINALGRIDX
keywords: grid4 nofinalgrid
keywords: scfconv7
keywords: smallprint printgap noloewdin
keywords: NOSOSCF
formula: C17H19N5O6S
InChI: InChI=1S/C17H19N5O6S/c1-27-13-9-14(28-2)19-16(18-13)20-17(24)22-29(25,26)21-12-6-4-3-5-11(12)15(23)10-7-8-10/h3-6,9-10,20-22H,7-8H2,1-2H3
48 atoms
S  -2.034399 2.202777 0.440708
O  -3.597338 -1.291236 -0.872502
O  -3.224666 2.30257 1.231868
O  -1.375739 3.374031 -0.087912
O  -1.8903 -0.484508 1.803355
O  3.300957 2.590842 0.035061
O  4.530878 -1.864438 0.458649
N  -2.381744 1.144441 -0.794338
N  -0.78998 1.440903 1.276747
N  0.363772 -0.53457 1.723282
N  1.830907 1.072787 0.903218
N  2.447358 -1.197027 1.103599
C  -2.214314 -3.113432 -0.345474
C  -3.302235 -4.155839 -0.479113
C  -3.046011 -3.542769 0.840185
C  -2.47558 -1.758747 -0.884453
C  -1.333597 -0.973805 -1.432672
C  -1.343207 0.435377 -1.417061
C  -0.245897 -1.626655 -2.009835
C  -0.276133 1.13296 -1.977156
C  0.820451 -0.928189 -2.546893
C  0.799457 0.456971 -2.526033
C  -0.86092 0.11291 1.61765
C  1.597237 -0.191158 1.215992
C  3.02274 1.34953 0.3854
C  3.636069 -0.902211 0.600889
C  3.994984 0.379687 0.200999
C  2.326406 3.602982 0.248895
C  4.177927 -3.180326 0.852943
H  -1.192533 -3.466593 -0.358825
H  -4.194332 -3.859231 -1.014289
H  -2.981041 -5.173279 -0.658045
H  -2.537538 -4.124325 1.597145
H  -3.751073 -2.81743 1.221422
H  -0.239119 -2.707282 -2.05763
H  -0.300685 2.212858 -1.995154
H  -3.219591 0.593161 -0.619923
H  1.652295 -1.459594 -2.988141
H  1.6189 1.020273 -2.952772
H  0.274307 -1.512277 1.956306
H  4.965757 0.606865 -0.211787
H  2.073754 3.704804 1.305196
H  1.411978 3.421244 -0.316436
H  2.781909 4.526016 -0.098791
H  3.942501 -3.236122 1.916146
H  5.050512 -3.793267 0.642951
H  3.324441 -3.55678 0.288116
H  0.147636 1.813929 1.099825
totalener: -1782.70222397 hartree
nucrepener: 3287.91095911 hartree
electener: -5070.61318308 hartree
oneelecener: -8979.52676867 hartree
twoeener: 3908.91358558 hartree
kineticenergy: 1776.20327281 hartree
xcener: -148.039187610631 hartree
chargesum: 0.0000000
charge: 0.861247 -0.392359 -0.408778 -0.464899 -0.346503 -0.261130 -0.263030 -0.219040 -0.195970 -0.158714 -0.405254 -0.388067 -0.098783 -0.117621 -0.114242 0.281796 -0.016833 0.130475 -0.134239 -0.240503 -0.149413 -0.081635 0.262879 0.329825 0.390587 0.384610 -0.297305 -0.116975 -0.125506 0.075783 0.093500 0.082412 0.078083 0.100650 0.125673 0.163924 0.206705 0.127959 0.132398 0.167998 0.129067 0.112767 0.093946 0.129326 0.109321 0.125009 0.103703 0.197155
qa: 0.8612 -0.3924 -0.4088 -0.4649 -0.3465 -0.2611 -0.2630 -0.2190 -0.1960 -0.1587 -0.4053 -0.3881 -0.0988 -0.1176 -0.1142 0.2818 -0.0168 0.1305 -0.1342 -0.2405 -0.1494 -0.0816 0.2629 0.3298 0.3906 0.3846 -0.2973 -0.1170 -0.1255 0.0758 0.0935 0.0824 0.0781 0.1006 0.1257 0.1639 0.2067 0.1280 0.1324 0.1680 0.1291 0.1128 0.0939 0.1293 0.1093 0.1250 0.1037 0.1972
va: 6.0174 2.0758 2.1054 2.0159 2.1573 2.1502 2.1491 3.0659 3.0805 3.1628 2.9479 2.9402 3.7514 3.9223 3.9351 3.8941 3.6464 3.8542 3.9530 4.0416 3.9432 3.8815 4.4920 4.2580 4.0021 4.0468 3.9389 3.8641 3.8794 1.0128 1.0315 1.0203 1.0205 1.0380 1.0052 1.0084 1.0546 1.0014 1.0004 1.0352 1.0216 0.9941 0.9997 0.9968 0.9967 0.9945 0.9969 1.0795
dispcorr: -0.032842353 hartree
energy: -1782.735066326454
dipole: 8.67466 -5.78451 2.89015 -16.63618 14.73164 -1.90455 -3.80341 3.27046 -0.53295
magnitude: 3.50204 au
magnitude: 8.90149 debye
