program: Orca
programVersion: 4.2.1
elementType: Cl S O O O O N N N N N C C C C C C C C C C C C H H H H H H H H H H H H
charge: 0
multiplicity: 1
keywords: wb97x-d3
keywords: def2-TZVPP
keywords: def2/J RIJCOSX GRIDX6 NOFINALGRIDX
keywords: grid4 nofinalgrid
keywords: scfconv7
keywords: smallprint printgap noloewdin
keywords: NOSOSCF
formula: C12H12ClN5O4S
InChI: InChI=1S/C12H12ClN5O4S/c1-7-14-10(17-12(15-7)22-2)16-11(19)18-23(20,21)9-6-4-3-5-8(9)13/h3-6,16,18H,1-2H3
35 atoms
Cl 0.941679 -0.135071 2.04919
S  1.766424 -1.278164 -0.877377
O  2.353152 -1.467483 -2.186378
O  1.505717 -2.431662 -0.040621
O  1.02576 1.280873 -2.157067
O  -3.35459 -1.855448 1.075929
N  0.281393 -0.545262 -1.031719
N  -1.115665 1.268084 -1.439649
N  -3.258219 1.647635 -0.760526
N  -2.186192 -0.359326 -0.175343
N  -4.391503 0.036914 0.52954
C  2.744808 -0.090596 -0.002582
C  2.388823 0.373852 1.262116
C  3.910749 0.361695 -0.606233
C  3.193374 1.293786 1.91167
C  4.721239 1.270642 0.051934
C  0.132521 0.697887 -1.583356
C  4.359408 1.736254 1.306021
C  -2.222639 0.827739 -0.765212
C  -4.3231 1.204719 -0.095105
C  -3.295097 -0.700864 0.457625
C  -5.502953 2.102577 -0.026471
C  -2.214948 -2.716959 1.047952
H  -0.513994 -0.93198 -0.504898
H  4.189294 0.010704 -1.588972
H  2.910433 1.663354 2.887286
H  5.628196 1.618073 -0.421485
H  4.982684 2.453091 1.822122
H  -6.402376 1.559029 0.248737
H  -5.324797 2.868295 0.731963
H  -5.659144 2.616905 -0.972446
H  -1.95197 -2.999132 0.029075
H  -2.505841 -3.605887 1.598874
H  -1.358176 -2.259898 1.542885
H  -1.205202 2.181299 -1.867153
elementType: Cl S O N C H
totalener: -1897.73654458 hartree
nucrepener: 2381.47321463 hartree
electener: -4279.20975921 hartree
oneelecener: -7339.03949622 hartree
twoeener: 3059.82973701 hartree
cpcmener: -0.04315721 hartree
kineticenergy: 1892.04504019 hartree
xcener: -136.566413450336 hartree
chargesum: -0.0000000
charge: -0.066095 0.875734 -0.502966 -0.502113 -0.462662 -0.274961 -0.221991 -0.123686 -0.407383 -0.418352 -0.367952 0.014375 0.016406 -0.095660 -0.123386 -0.146128 0.369311 -0.129192 0.392856 0.328857 0.458639 -0.238729 -0.123932 0.213041 0.158370 0.149959 0.170255 0.170309 0.097449 0.117647 0.104263 0.122947 0.140539 0.106676 0.197557
qa: -0.0661 0.8757 -0.5030 -0.5021 -0.4627 -0.2750 -0.2220 -0.1237 -0.4074 -0.4184 -0.3680 0.0144 0.0164 -0.0957 -0.1234 -0.1461 0.3693 -0.1292 0.3929 0.3289 0.4586 -0.2387 -0.1239 0.2130 0.1584 0.1500 0.1703 0.1703 0.0974 0.1176 0.1043 0.1229 0.1405 0.1067 0.1976
va: 1.2641 5.8430 1.9930 1.9783 2.0491 2.1379 3.0700 3.2153 3.0164 2.9527 3.0055 3.6241 3.9783 3.9260 3.9588 3.9300 4.4022 3.9236 4.2333 3.9557 4.2240 3.9310 3.8509 1.0698 1.0142 0.9994 0.9854 0.9836 1.0160 0.9987 1.0086 0.9889 0.9988 0.9944 1.0146
dispcorr: -0.019214179 hartree
energy: -1897.755758761557
dipole: -8.24227 7.86662 -0.37564 5.21367 -3.28434 1.92933 0.76835 0.82377 1.59212
magnitude: 2.52947 au
magnitude: 6.42941 debye
