program: Orca
programVersion: 4.2.1
elementType: Cl S O O O O N N N N N C C C C C C C C C C C C H H H H H H H H H H H H
charge: 0
multiplicity: 1
keywords: wb97x-d3
keywords: def2-TZVPP
keywords: def2/J RIJCOSX GRIDX6 NOFINALGRIDX
keywords: grid4 nofinalgrid
keywords: scfconv7
keywords: smallprint printgap noloewdin
keywords: NOSOSCF
formula: C12H12ClN5O4S
InChI: InChI=1S/C12H12ClN5O4S/c1-7-14-10(17-12(15-7)22-2)16-11(19)18-23(20,21)9-6-4-3-5-8(9)13/h3-6,16,18H,1-2H3
35 atoms
Cl 1.125859 2.198062 0.892586
S  1.736591 0.351616 -1.695157
O  1.345373 1.657207 -2.185952
O  2.272775 -0.621516 -2.62339
O  1.326289 -2.140232 -0.17879
O  -5.288777 -1.724455 1.292696
N  0.360246 -0.250716 -0.98577
N  -0.868196 -1.801711 0.229731
N  -2.183231 0.010946 -0.400245
N  -3.070051 -1.809594 0.795037
N  -4.460523 -0.014806 0.147876
C  2.879595 0.522059 -0.354914
C  2.618793 1.351732 0.733355
C  4.083292 -0.165209 -0.43477
C  3.563366 1.491357 1.735494
C  5.029592 -0.016746 0.56439
C  0.347212 -1.438718 -0.312323
C  4.768031 0.811015 1.644622
C  -2.078441 -1.16354 0.197758
C  -3.405116 0.551368 -0.400466
C  -4.230023 -1.187769 0.736554
C  -3.553609 1.875179 -1.054261
C  -5.158637 -2.966958 1.985782
H  -0.512769 0.300046 -1.01274
H  4.286737 -0.815017 -1.273064
H  3.359449 2.129919 2.583395
H  5.966023 -0.551469 0.497158
H  5.501641 0.930266 2.429625
H  -4.597096 2.16329 -1.136565
H  -3.030029 2.632538 -0.468565
H  -3.100694 1.867059 -2.044807
H  -6.153071 -3.19998 2.353978
H  -4.473337 -2.881448 2.827503
H  -4.824276 -3.761886 1.321378
H  -0.857426 -2.690036 0.715004
elementType: Cl S O N C H
totalener: -1897.73779524 hartree
nucrepener: 2327.88963770 hartree
electener: -4225.62743294 hartree
oneelecener: -7232.44899643 hartree
twoeener: 3006.82156348 hartree
cpcmener: -0.04503321 hartree
kineticenergy: 1892.04916306 hartree
xcener: -136.567057768149 hartree
chargesum: 0.0000000
charge: -0.058124 0.878276 -0.506701 -0.506128 -0.470746 -0.278490 -0.223314 -0.128692 -0.412837 -0.413940 -0.367031 0.020330 -0.008871 -0.094245 -0.117022 -0.146671 0.383002 -0.128854 0.396910 0.324954 0.468523 -0.248172 -0.115963 0.215463 0.157472 0.148002 0.169941 0.169356 0.099618 0.112742 0.110083 0.133951 0.120203 0.118516 0.198461
qa: -0.0581 0.8783 -0.5067 -0.5061 -0.4707 -0.2785 -0.2233 -0.1287 -0.4128 -0.4139 -0.3670 0.0203 -0.0089 -0.0942 -0.1170 -0.1467 0.3830 -0.1289 0.3969 0.3250 0.4685 -0.2482 -0.1160 0.2155 0.1575 0.1480 0.1699 0.1694 0.0996 0.1127 0.1101 0.1340 0.1202 0.1185 0.1985
va: 1.2688 5.8396 1.9731 1.9914 2.0430 2.1268 3.0715 3.2136 3.0108 2.9588 3.0145 3.6404 4.0096 3.9189 3.9496 3.9287 4.3971 3.9202 4.2130 3.9294 4.2284 3.9317 3.8416 1.0694 1.0151 1.0006 0.9856 0.9840 1.0184 1.0002 1.0031 0.9939 0.9944 0.9948 1.0126
dispcorr: -0.017434678 hartree
energy: -1897.755229921059
dipole: -9.44765 8.87331 -0.57433 -6.15447 5.63377 -0.52070 5.65312 -2.76967 2.88345
magnitude: 2.98585 au
magnitude: 7.58942 debye
