program: Orca
programVersion: 4.2.1
elementType: Cl S O O O O N N N N N C C C C C C C C C C C C H H H H H H H H H H H H
charge: 0
multiplicity: 1
keywords: wb97x-d3
keywords: def2-TZVPP
keywords: def2/J RIJCOSX GRIDX6 NOFINALGRIDX
keywords: grid4 nofinalgrid
keywords: scfconv7
keywords: smallprint printgap noloewdin
keywords: NOSOSCF
formula: C12H12ClN5O4S
InChI: InChI=1S/C12H12ClN5O4S/c1-7-14-10(17-12(15-7)22-2)16-11(19)18-23(20,21)9-6-4-3-5-8(9)13/h3-6,16,18H,1-2H3
35 atoms
Cl 1.179797 -0.115651 2.153225
S  1.683875 -1.203263 -0.862129
O  2.147557 -1.39136 -2.220084
O  1.445623 -2.362604 -0.026736
O  0.939415 1.396114 -2.055205
O  -3.440393 -1.822729 1.091654
N  0.226781 -0.406074 -0.874283
N  -1.216456 1.342496 -1.383583
N  -3.436843 1.581625 -0.924958
N  -2.273017 -0.293948 -0.120131
N  -4.566394 -0.05849 0.330799
C  2.786777 -0.080902 -0.054685
C  2.574356 0.351181 1.252984
C  3.909719 0.340993 -0.754131
C  3.484619 1.204184 1.853108
C  4.8233 1.185771 -0.147835
C  0.051905 0.807177 -1.478253
C  4.608445 1.614829 1.152266
C  -2.345605 0.851263 -0.785859
C  -4.527569 1.078947 -0.34867
C  -3.410461 -0.699343 0.416132
C  -5.78725 1.84941 -0.500899
C  -2.233942 -2.573807 1.239374
H  -0.568123 -0.811181 -0.361143
H  4.074933 0.014459 -1.770323
H  3.31678 1.546348 2.864732
H  5.696431 1.510151 -0.695587
H  5.31526 2.278306 1.630782
H  -6.105723 1.824468 -1.544584
H  -6.583215 1.439404 0.113761
H  -5.630899 2.895449 -0.240159
H  -2.501299 -3.445872 1.82766
H  -1.474798 -2.004561 1.775238
H  -1.846838 -2.900541 0.274759
H  -1.328584 2.23024 -1.857053
elementType: Cl S O N C H
totalener: -1897.73718182 hartree
nucrepener: 2364.99937549 hartree
electener: -4262.73655730 hartree
oneelecener: -7306.16199195 hartree
twoeener: 3043.42543465 hartree
cpcmener: -0.04322752 hartree
kineticenergy: 1892.04226794 hartree
xcener: -136.566319482718 hartree
chargesum: 0.0000000
charge: -0.065372 0.875428 -0.503785 -0.503770 -0.467954 -0.276606 -0.221267 -0.126339 -0.411214 -0.419065 -0.366679 0.020160 0.005766 -0.093419 -0.123819 -0.146103 0.378903 -0.130149 0.392166 0.330364 0.463119 -0.236357 -0.125845 0.217236 0.158585 0.149936 0.170301 0.170068 0.113529 0.095652 0.107776 0.140308 0.111752 0.119803 0.196891
qa: -0.0654 0.8754 -0.5038 -0.5038 -0.4680 -0.2766 -0.2213 -0.1263 -0.4112 -0.4191 -0.3667 0.0202 0.0058 -0.0934 -0.1238 -0.1461 0.3789 -0.1301 0.3922 0.3304 0.4631 -0.2364 -0.1258 0.2172 0.1586 0.1499 0.1703 0.1701 0.1135 0.0957 0.1078 0.1403 0.1118 0.1198 0.1969
va: 1.2633 5.8420 1.9937 1.9760 2.0460 2.1375 3.0780 3.2156 3.0126 2.9569 3.0091 3.6354 3.9865 3.9177 3.9558 3.9284 4.4000 3.9228 4.2386 3.9541 4.2150 3.9299 3.8542 1.0604 1.0146 0.9996 0.9855 0.9838 1.0009 1.0178 1.0052 0.9990 0.9908 0.9909 1.0151
dispcorr: -0.018756914 hartree
energy: -1897.755938731785
dipole: -8.70394 8.48317 -0.22077 4.52848 -2.72129 1.80719 -0.47480 1.95280 1.47800
magnitude: 2.34503 au
magnitude: 5.96058 debye
