program: Gaussian 09
title: 000074019
version: EM64L-G09RevD.01
frameworkgroup: C1[X(C8H12O2)]
method: RPBEPBE
basis: SDD
operation: Freq
keyword: #pfreq=noraman
keyword: PBEPBE/SDD
title: #p freq=noraman PBEPBE/SDD
converged: YES YES NO NO
title: Mulliken charges:
elementType: O O C C C C C C C C H H H H H H H H H H H H
charge: -0.299289 -0.234209 -0.410031 -0.410437 -0.483087 -0.415383 0.366904 -0.341107 0.255799 -0.747067 0.207651 0.205926 0.207808 0.210932 0.261396 0.222752 0.212224 0.216908 0.229676 0.247511 0.250006 0.245116
chargesum: 0.00000
title: Mulliken charges with hydrogens summed into heavy atoms:
elementType: O O C C C C C C C C
charge: -0.299289 -0.234209 0.003547 0.008303 0.001062 0.013749 0.366904 -0.111431 0.255799 -0.004435
polarizability: 1.15870294e+02 7.80942911e+00 8.74848610e+01 2.44536489e+00 -1.27253482e+00 6.88731582e+01
1716.lowfreq: -20.1734 -5.3885 -0.0005 0.0007 0.0008 6.3128 41.1747 54.7544 86.3838
frequency: 41.1408 54.4967 86.3431 109.6500 168.0377 242.6529 295.4661 310.6099 356.2991 436.2555 450.6142 487.7306 558.7208 574.9505 677.9049 741.9927 801.6405 825.3117 858.4677 874.6519 916.1443 927.7475 962.3632 994.2915 1039.6639 1058.1328 1070.8749 1084.5902 1105.8444 1137.6983 1167.6847 1187.0934 1235.6941 1257.4136 1293.8290 1329.7485 1331.8739 1344.6897 1357.1603 1381.9582 1453.0386 1454.6372 1456.3538 1464.4867 1469.1878 1476.0092 1659.1093 1703.2683 2955.3457 2980.4912 2983.8455 2989.4740 3008.2381 3011.7097 3035.3928 3045.7698 3055.7202 3096.3685 3134.9650 3143.9980
redmass: 4.1099 1.4550 1.9582 3.1038 2.7866 2.4737 2.9467 2.0632 5.0616 2.7233 2.4671 4.1575 3.0228 3.2229 4.0232 2.7070 1.3868 3.2199 1.5362 3.1060 1.5207 2.0234 2.7461 1.9241 1.6505 1.8979 2.3765 2.2575 1.5735 1.1704 1.5190 3.6694 1.3200 1.2039 1.3430 1.8209 1.3791 1.4880 1.6294 1.2402 1.0610 1.0475 1.0926 1.0822 1.0843 1.0931 9.6916 7.3623 1.0643 1.0612 1.0646 1.0625 1.0366 1.0925 1.0984 1.1000 1.1030 1.0974 1.0917 1.1011
irintensity: 1.1761 2.3027 1.6786 2.0286 5.4122 0.6263 2.0760 0.5021 1.9243 3.2606 2.8258 2.3998 4.0637 11.2522 4.3645 3.0388 7.0990 8.1312 21.3945 39.1342 3.7273 13.1279 2.4316 55.2299 10.2524 25.7930 80.7928 77.0669 31.9608 2.5449 3.4819 350.1536 3.7624 2.6088 1.9660 11.8950 4.5178 0.9668 16.8022 51.9762 28.1459 17.8845 0.7435 18.5698 11.9989 6.0065 186.1472 25.2614 42.9539 24.9587 22.9283 38.7104 2.6846 43.5500 15.1627 49.9468 58.2089 7.5552 13.2639 11.1972
temp: 298.150 k
press: 1.00000 atm
elementType: 8 8 6 6 6 6 6 6 6 6 1 1 1 1 1 1 1 1 1 1 1 1
symmnumber: 1
zpe: 482782.0 jmol-1
zpe.correction: 0.183882 hartree
zpe.thermalcorrener: 0.194291 hartree
zpe.thermalcorrenthalpy: 0.195235 hartree
zpe.thermalcorrgfe: 0.147032 hartree
zpe.sumelectzpe: -461.711026 hartree
zpe.sumelectthermal: -461.700617 hartree
zpe.sumelectthermalent: -461.699672 hartree
zpe.sumelectthermalfe: -461.747875 hartree
dipole: 0.6957 0.8762 -1.3780
dipole: 1.7750
quadrupole: -51.1243 -59.5449 -63.1625
quadrupole: -2.7227 3.8060 3.6649
quadrupole: 6.8196 -1.6010 -5.2186 -2.7227 3.8060 3.6649
hfenergy: -461.8949078 hartree
pointgroup: C01 [X(C8H12O2)]
dipole: -0.2682283 0.0937346 0.6379069 debye
dipolederiv: -1.8233794 0.3210266 0.3083317 0.1917965 -0.4021761 -0.1589997 0.309437 -0.147276 -0.5506628 -0.6284848 -0.0357603 -0.1312978 0.1272625 -0.3819494 -0.1822319 0.338165 -0.2545478 -0.9114953 0.1001956 0.0586778 0.0076565 -0.0023827 0.0525204 0.024293 -0.0423763 0.0124278 0.1691762 0.0913306 0.0264335 -0.0408084 0.0383263 0.0233501 -0.0142963 -0.0035537 0.0030183 0.1134393 -0.1761583 0.0123978 -0.0147746 -0.0400101 -0.0368203 -0.0693299 -0.0246264 -0.0870622 0.1047265 0.0308474 -0.0210514 -0.0468616 0.0280289 0.0384348 -0.048922 0.0517149 -0.0824848 0.1546031 1.0631999 -0.1534841 -0.0249342 0.0552636 0.4149483 0.0603065 0.2558235 0.0750955 -0.0455775 -0.0505218 -0.0083266 0.0852184 0.0650137 -0.1423437 0.0583631 -0.0199147 0.0358087 -0.2032642 1.7542169 -0.2054102 -0.0956816 -0.4173598 0.3884801 0.3771258 -0.6859706 0.4404962 1.2890305 -0.3666194 -0.0028301 -0.1399336 -0.0171928 0.0133343 -0.0360883 -0.2310755 -0.0175051 -0.0973801 -0.009004 -0.0778016 -0.0341093 -0.0966425 -0.1304364 -0.0834383 -0.0613968 -0.111841 0.031628 0.0104405 -0.0003952 0.0362926 0.0277204 0.0645503 0.0111504 0.0819771 0.0721867 -0.1613017 -0.2411386 -0.0036921 -0.0291852 -0.0098032 0.0530388 -0.005142 -0.0024722 -0.0025171 0.0795857 0.0827986 -0.0079926 0.0856003 -0.0079563 0.0218686 0.0178897 0.0174924 0.0230571 -0.158428 0.091664 -0.0164079 0.0387961 0.0165977 0.0445834 -0.0139393 0.0520856 -0.0612466 -0.0501763 0.0099593 0.0680882 -0.0699984 0.086182 -0.0710716 0.0555574 -0.0736025 0.1052778 0.0301975 -0.0959633 0.0523849 0.1004356 -0.0363876 0.0927903 -0.0086297 0.0948734 -0.0515744 -0.1113132 0.0120109 0.0522121 -0.0218422 0.0493171 -0.1305082 0.0774836 -0.0834168 0.1194345 0.0431795 0.0082562 -0.0768949 -0.0669885 -0.0897777 -0.0194041 -0.0698695 -0.070069 -0.0701925 0.1374767 0.0764896 -0.0215195 0.0159197 0.0207764 0.057289 0.1062371 -0.0005583 0.0954077 -0.0010851 0.0887182 0.0046825 -0.0148637 -0.0419662 -0.0564605 -0.0563388 -0.0033941 -0.0509125 0.1198121 -0.0288581 0.0356633 0.0530284 0.0531936 0.1059819 -0.0411808 0.1008578 -0.0450503 0.0178293 unknown
polarizability: 114.5895105|-10.303805|84.2559296|-0.6011997|8.1328715|73.3828731 unknown
InChI: InChI=1S/C8H12O2/c1-7(9)10-8-5-3-2-4-6-8/h5H,2-4,6H2,1H3
charge 0 multiplicity 1
22 atoms
O  1.2771 0.187831 0.655889
O  2.01243 -0.574639 -1.439368
C  -2.213035 -1.226981 -0.031689
C  -2.842907 0.078814 -0.570672
C  -0.670961 -1.19646 -0.177168
C  -2.350281 1.304444 0.237746
C  -0.123776 0.135453 0.28921
C  -0.85661 1.253748 0.505011
C  2.261064 -0.220969 -0.268266
C  3.626058 -0.143018 0.38184
H  -2.616896 -2.104142 -0.571043
H  -2.48276 -1.347434 1.036443
H  -3.947045 0.020828 -0.531138
H  -2.561166 0.203154 -1.634923
H  -0.370619 -1.372773 -1.22693
H  -0.211368 -2.008749 0.420177
H  -2.892086 1.36349 1.20585
H  -2.595567 2.24033 -0.302578
H  -0.357879 2.151447 0.890871
H  3.657243 -0.781432 1.281524
H  3.829239 0.891643 0.708529
H  4.396223 -0.465286 -0.333312
