program: Orca
programVersion: 4.2.1
elementType: Cl S O O O O N N N N N C C C C C C C C C C C C H H H H H H H H H H H H
charge: 0
multiplicity: 1
keywords: wb97x-d3
keywords: def2-TZVPP
keywords: def2/J RIJCOSX GRIDX6 NOFINALGRIDX
keywords: grid4 nofinalgrid
keywords: scfconv7
keywords: smallprint printgap noloewdin
keywords: NOSOSCF
formula: C12H12ClN5O4S
InChI: InChI=1S/C12H12ClN5O4S/c1-7-14-10(17-12(15-7)22-2)16-11(19)18-23(20,21)9-6-4-3-5-8(9)13/h3-6,16,18H,1-2H3
35 atoms
Cl 1.169896 -0.056741 2.191081
S  1.715485 -1.220901 -0.795331
O  2.205551 -1.43864 -2.137709
O  1.465349 -2.351832 0.073044
O  0.96132 1.347857 -2.072537
O  -3.461944 -1.873395 1.027388
N  0.254902 -0.428193 -0.847797
N  -1.18975 1.30986 -1.382007
N  -3.383302 1.609425 -0.842962
N  -2.268096 -0.336268 -0.146101
N  -4.534784 -0.032234 0.386545
C  2.798823 -0.064556 -0.001711
C  2.565906 0.404519 1.289531
C  3.927312 0.346519 -0.698712
C  3.458168 1.288084 1.87314
C  4.824705 1.218958 -0.107545
C  0.0788 0.770223 -1.481217
C  4.586779 1.6887 1.174437
C  -2.315016 0.836136 -0.765704
C  -4.472043 1.130235 -0.246058
C  -3.405968 -0.722833 0.405306
C  -5.707178 1.953895 -0.32203
C  -2.289419 -2.68624 1.0886
H  -0.547456 -0.838454 -0.352006
H  4.107543 -0.011058 -1.702378
H  3.273108 1.660875 2.871263
H  5.702899 1.53442 -0.653285
H  5.279736 2.376076 1.640431
H  -6.446337 1.625732 0.404136
H  -5.480774 3.007389 -0.165233
H  -6.144683 1.86403 -1.318837
H  -2.583195 -3.584507 1.62385
H  -1.488953 -2.192923 1.640787
H  -1.941437 -2.963713 0.093574
H  -1.299534 2.205438 -1.841408
elementType: Cl S O N C H
totalener: -1897.74011793 hartree
nucrepener: 2363.71968333 hartree
electener: -4261.45980126 hartree
oneelecener: -7303.56363543 hartree
twoeener: 3042.10383417 hartree
cpcmener: -0.03608367 hartree
kineticenergy: 1892.04094461 hartree
xcener: -136.563649729564 hartree
chargesum: 0.0000000
charge: -0.063114 0.868586 -0.488755 -0.493577 -0.443601 -0.266819 -0.223426 -0.130727 -0.406848 -0.420573 -0.360871 0.014940 0.002086 -0.087770 -0.123831 -0.145312 0.365337 -0.129545 0.392024 0.321555 0.451652 -0.237612 -0.124133 0.215168 0.156636 0.146881 0.166471 0.166422 0.097818 0.104761 0.113978 0.138644 0.108862 0.120649 0.194047
qa: -0.0631 0.8686 -0.4888 -0.4936 -0.4436 -0.2668 -0.2234 -0.1307 -0.4068 -0.4206 -0.3609 0.0149 0.0021 -0.0878 -0.1238 -0.1453 0.3653 -0.1295 0.3920 0.3216 0.4517 -0.2376 -0.1241 0.2152 0.1566 0.1469 0.1665 0.1664 0.0978 0.1048 0.1140 0.1386 0.1089 0.1206 0.1940
va: 1.2633 5.8549 2.0117 1.9889 2.0756 2.1473 3.0712 3.2083 3.0147 2.9549 3.0089 3.6480 3.9925 3.9203 3.9594 3.9319 4.4128 3.9262 4.2341 3.9619 4.2322 3.9288 3.8541 1.0600 1.0158 1.0012 0.9870 0.9851 1.0162 1.0075 1.0003 0.9980 0.9933 0.9907 1.0172
dispcorr: -0.018684759 hartree
energy: -1897.758802686136
dipole: -8.77755 8.53941 -0.23814 4.50114 -2.80310 1.69804 -0.64113 1.93661 1.29548
magnitude: 2.14903 au
magnitude: 5.46239 debye
