program: Orca
programVersion: 4.2.1
elementType: Cl S O O O O N N N N N C C C C C C C C C C C C H H H H H H H H H H H H
charge: 0
multiplicity: 1
keywords: wb97x-d3
keywords: def2-TZVPP
keywords: def2/J RIJCOSX GRIDX6 NOFINALGRIDX
keywords: grid4 nofinalgrid
keywords: scfconv7
keywords: smallprint printgap noloewdin
keywords: NOSOSCF
formula: C12H12ClN5O4S
InChI: InChI=1S/C12H12ClN5O4S/c1-7-14-10(17-12(15-7)22-2)16-11(19)18-23(20,21)9-6-4-3-5-8(9)13/h3-6,16,18H,1-2H3
35 atoms
Cl 1.118371 -0.26815 2.168804
S  1.765027 -1.257115 -0.880273
O  2.325029 -1.407145 -2.197934
O  1.480774 -2.407118 -0.054526
O  0.999276 1.3841 -2.099603
O  -3.372055 -1.83099 1.112108
N  0.297708 -0.463521 -0.965042
N  -1.153485 1.294499 -1.421772
N  -3.313069 1.638656 -0.79034
N  -2.21148 -0.335196 -0.143631
N  -4.436449 0.034549 0.518728
C  2.784218 -0.102988 0.008936
C  2.514825 0.278924 1.319768
C  3.89801 0.405228 -0.644426
C  3.366568 1.155189 1.972688
C  4.751131 1.275774 0.010798
C  0.13318 0.765792 -1.541433
C  4.484901 1.646041 1.318928
C  -2.258887 0.840645 -0.760436
C  -4.376712 1.185827 -0.131643
C  -3.327389 -0.686504 0.476974
C  -5.598828 2.038994 -0.147735
C  -2.222497 -2.669675 1.102207
H  -0.49202 -0.870485 -0.455368
H  4.086267 0.121457 -1.669589
H  3.149581 1.451119 2.989478
H  5.616839 1.667768 -0.504146
H  5.144521 2.328357 1.837814
H  -6.298289 1.727882 0.622764
H  -5.336947 3.087254 -0.017359
H  -6.092786 1.949804 -1.117193
H  -2.492547 -3.541764 1.690043
H  -1.357686 -2.184487 1.555646
H  -1.960336 -2.98482 0.09166
H  -1.266005 2.199037 -1.856379
totalener: -1897.71000276 hartree
nucrepener: 2368.28128965 hartree
electener: -4265.99129242 hartree
oneelecener: -7312.17615776 hartree
twoeener: 3046.18486535 hartree
kineticenergy: 1892.08644738 hartree
xcener: -136.562766885188 hartree
chargesum: -0.0000000
charge: -0.064719 0.850382 -0.429364 -0.450914 -0.357043 -0.231218 -0.232332 -0.160018 -0.368913 -0.423961 -0.298384 -0.033974 0.016727 -0.046677 -0.127660 -0.119215 0.333597 -0.113425 0.377606 0.257609 0.409698 -0.227651 -0.125851 0.201856 0.145772 0.124598 0.136204 0.135380 0.105944 0.100330 0.097866 0.129495 0.100936 0.113783 0.173535
qa: -0.0647 0.8504 -0.4294 -0.4509 -0.3570 -0.2312 -0.2323 -0.1600 -0.3689 -0.4240 -0.2984 -0.0340 0.0167 -0.0467 -0.1277 -0.1192 0.3336 -0.1134 0.3776 0.2576 0.4097 -0.2277 -0.1259 0.2019 0.1458 0.1246 0.1362 0.1354 0.1059 0.1003 0.0979 0.1295 0.1009 0.1138 0.1735
va: 1.2608 5.8767 2.0774 2.0362 2.1595 2.1742 3.0720 3.1835 3.0185 2.9614 3.0227 3.7842 3.9943 3.9401 4.0156 3.9581 4.4113 3.9651 4.2173 4.0211 4.2571 3.9080 3.8750 1.0690 1.0230 1.0100 0.9982 0.9963 1.0158 1.0091 1.0052 0.9982 0.9961 0.9938 1.0334
dispcorr: -0.018890206 hartree
energy: -1897.728892969110
dipole: -8.72088 8.48066 -0.24022 5.23964 -4.07873 1.16091 0.11677 0.87110 0.98787
magnitude: 1.54315 au
magnitude: 3.92238 debye
