program: Orca
programVersion: 4.2.1
elementType: Cl S O O O O N N N N N C C C C C C C C C C C C H H H H H H H H H H H H
charge: 0
multiplicity: 1
keywords: wb97x-d3
keywords: def2-TZVPP
keywords: def2/J RIJCOSX GRIDX6 NOFINALGRIDX
keywords: grid4 nofinalgrid
keywords: scfconv7
keywords: smallprint printgap noloewdin
keywords: NOSOSCF
formula: C12H12ClN5O4S
InChI: InChI=1S/C12H12ClN5O4S/c1-7-14-10(17-12(15-7)22-2)16-11(19)18-23(20,21)9-6-4-3-5-8(9)13/h3-6,16,18H,1-2H3
35 atoms
Cl 1.247922 2.366053 0.833979
S  1.758325 0.377106 -1.699662
O  1.361185 1.679058 -2.176046
O  2.290239 -0.615872 -2.597522
O  1.308322 -2.133186 -0.144824
O  -5.294348 -1.747236 1.316587
N  0.382159 -0.214919 -0.949756
N  -0.886427 -1.777786 0.224965
N  -2.214721 0.03074 -0.390225
N  -3.085674 -1.807936 0.791254
N  -4.488123 -0.006823 0.191659
C  2.901125 0.545308 -0.347279
C  2.688378 1.432535 0.703596
C  4.057435 -0.220832 -0.384702
C  3.640984 1.558468 1.702216
C  5.009744 -0.089745 0.610762
C  0.356317 -1.414756 -0.29809
C  4.800656 0.802716 1.649585
C  -2.096228 -1.149051 0.1969
C  -3.441176 0.560577 -0.367473
C  -4.249066 -1.188158 0.756925
C  -3.612839 1.885722 -1.025825
C  -5.133343 -3.01163 1.943218
H  -0.473355 0.349122 -0.987202
H  4.201807 -0.922781 -1.192991
H  3.470058 2.247964 2.517008
H  5.90889 -0.688681 0.575425
H  5.539765 0.911606 2.431861
H  -2.978306 2.629395 -0.542674
H  -3.297473 1.832132 -2.067973
H  -4.647812 2.209793 -0.976554
H  -6.114898 -3.274045 2.327325
H  -4.419356 -2.965086 2.76562
H  -4.802152 -3.771992 1.235848
H  -0.88011 -2.669301 0.698554
totalener: -1897.71076117 hartree
nucrepener: 2318.36589383 hartree
electener: -4216.07665500 hartree
oneelecener: -7212.77808312 hartree
twoeener: 2996.70142811 hartree
kineticenergy: 1892.08564430 hartree
xcener: -136.561291632286 hartree
chargesum: -0.0000000
charge: -0.052374 0.848620 -0.440259 -0.432203 -0.364646 -0.232170 -0.237130 -0.162405 -0.410347 -0.402444 -0.295839 -0.027832 -0.005377 -0.046368 -0.122281 -0.119839 0.342613 -0.112757 0.382511 0.270558 0.413197 -0.240081 -0.127884 0.210109 0.143496 0.122173 0.134515 0.133383 0.100518 0.103393 0.109198 0.126610 0.109926 0.110275 0.171143
qa: -0.0524 0.8486 -0.4403 -0.4322 -0.3646 -0.2322 -0.2371 -0.1624 -0.4103 -0.4024 -0.2958 -0.0278 -0.0054 -0.0464 -0.1223 -0.1198 0.3426 -0.1128 0.3825 0.2706 0.4132 -0.2401 -0.1279 0.2101 0.1435 0.1222 0.1345 0.1334 0.1005 0.1034 0.1092 0.1266 0.1099 0.1103 0.1711
va: 1.2726 5.8769 2.0500 2.0753 2.1532 2.1647 3.0769 3.1834 3.0014 2.9654 3.0262 3.7954 4.0316 3.9335 4.0055 3.9556 4.4085 3.9613 4.2052 3.9706 4.2652 3.9084 3.8742 1.0624 1.0243 1.0114 0.9985 0.9968 1.0049 1.0051 1.0175 0.9945 0.9962 0.9964 1.0338
dispcorr: -0.017205125 hartree
energy: -1897.727966297146
dipole: -9.80130 9.27405 -0.52724 -6.83877 6.36913 -0.46964 5.68186 -3.80647 1.87539
magnitude: 2.00390 au
magnitude: 5.09351 debye
