program: Orca
programVersion: 4.2.1
elementType: Cl S O O O O N N N N N C C C C C C C C C C C C H H H H H H H H H H H H
charge: 0
multiplicity: 1
keywords: wb97x-d3
keywords: def2-TZVPP
keywords: def2/J RIJCOSX GRIDX6 NOFINALGRIDX
keywords: grid4 nofinalgrid
keywords: scfconv7
keywords: smallprint printgap noloewdin
keywords: NOSOSCF
formula: C12H12ClN5O4S
InChI: InChI=1S/C12H12ClN5O4S/c1-7-14-10(17-12(15-7)22-2)16-11(19)18-23(20,21)9-6-4-3-5-8(9)13/h3-6,16,18H,1-2H3
35 atoms
Cl 1.287744 -0.20796 2.237859
S  1.696129 -1.208157 -0.845997
O  2.167173 -1.382013 -2.195695
O  1.428946 -2.344202 0.004271
O  0.915852 1.422587 -2.082849
O  -3.459141 -1.806237 1.111846
N  0.250125 -0.371819 -0.847356
N  -1.241254 1.317443 -1.423472
N  -3.457724 1.561326 -0.966404
N  -2.295049 -0.304596 -0.132831
N  -4.584354 -0.046537 0.335074
C  2.804443 -0.083261 -0.030637
C  2.638359 0.30051 1.296835
C  3.885651 0.392237 -0.759031
C  3.562265 1.144974 1.891098
C  4.81025 1.231394 -0.162256
C  0.059377 0.81614 -1.497376
C  4.64804 1.602536 1.162464
C  -2.364763 0.832083 -0.817742
C  -4.541754 1.07394 -0.367919
C  -3.433621 -0.695163 0.41877
C  -5.805635 1.848332 -0.522699
C  -2.260113 -2.560654 1.245239
H  -0.536049 -0.780035 -0.334096
H  3.993877 0.106045 -1.795075
H  3.42706 1.441264 2.921866
H  5.650389 1.597818 -0.735193
H  5.365325 2.258622 1.636884
H  -6.166969 1.757723 -1.548427
H  -6.572801 1.477554 0.150509
H  -5.629022 2.907219 -0.341017
H  -2.521227 -3.418227 1.858144
H  -1.473254 -1.99052 1.740374
H  -1.889218 -2.908477 0.280409
H  -1.371221 2.190389 -1.914234
totalener: -1897.71018319 hartree
nucrepener: 2355.63591854 hartree
electener: -4253.34610173 hartree
oneelecener: -7286.93751759 hartree
twoeener: 3033.59141586 hartree
kineticenergy: 1892.08464083 hartree
xcener: -136.562242603139 hartree
chargesum: 0.0000000
charge: -0.062547 0.849433 -0.429721 -0.450521 -0.359325 -0.231891 -0.234665 -0.160295 -0.370614 -0.426153 -0.297270 -0.027709 0.010115 -0.046585 -0.128011 -0.118826 0.338039 -0.114037 0.377145 0.258401 0.411719 -0.226773 -0.124940 0.203113 0.145556 0.124414 0.136112 0.135370 0.097934 0.106023 0.099351 0.129544 0.100344 0.113578 0.173691
qa: -0.0625 0.8494 -0.4297 -0.4505 -0.3593 -0.2319 -0.2347 -0.1603 -0.3706 -0.4262 -0.2973 -0.0277 0.0101 -0.0466 -0.1280 -0.1188 0.3380 -0.1140 0.3771 0.2584 0.4117 -0.2268 -0.1249 0.2031 0.1456 0.1244 0.1361 0.1354 0.0979 0.1060 0.0994 0.1295 0.1003 0.1136 0.1737
va: 1.2625 5.8747 2.0778 2.0357 2.1589 2.1743 3.0768 3.1833 3.0173 2.9621 3.0249 3.7865 4.0032 3.9357 4.0138 3.9555 4.4121 3.9646 4.2188 4.0209 4.2526 3.9079 3.8766 1.0639 1.0233 1.0101 0.9983 0.9964 1.0053 1.0165 1.0083 0.9980 0.9952 0.9952 1.0334
dispcorr: -0.018535099 hartree
energy: -1897.728718285908
dipole: -9.02790 8.86574 -0.16216 4.78738 -3.64872 1.13866 -0.77697 1.71855 0.94158
magnitude: 1.48641 au
magnitude: 3.77816 debye
