program: Orca
programVersion: 4.2.1
elementType: Cl S O O O O N N N N N C C C C C C C C C C C C H H H H H H H H H H H H
charge: 0
multiplicity: 1
keywords: wb97x-d3
keywords: def2-TZVPP
keywords: def2/J RIJCOSX GRIDX6 NOFINALGRIDX
keywords: grid4 nofinalgrid
keywords: scfconv7
keywords: smallprint printgap noloewdin
keywords: NOSOSCF
formula: C12H12ClN5O4S
InChI: InChI=1S/C12H12ClN5O4S/c1-7-14-10(17-12(15-7)22-2)16-11(19)18-23(20,21)9-6-4-3-5-8(9)13/h3-6,16,18H,1-2H3
35 atoms
Cl 1.188617 -0.200285 2.200846
S  1.728702 -1.244037 -0.848801
O  2.246961 -1.425042 -2.180237
O  1.453494 -2.375175 0.006263
O  0.957955 1.383678 -2.097831
O  -3.427852 -1.822781 1.103033
N  0.270168 -0.432685 -0.906399
N  -1.1994 1.289397 -1.436759
N  -3.386762 1.597232 -0.887616
N  -2.260884 -0.330797 -0.150461
N  -4.518043 -0.003356 0.419164
C  2.788123 -0.08927 -0.011286
C  2.564072 0.316729 1.300901
C  3.887747 0.393171 -0.706704
C  3.446735 1.192346 1.91242
C  4.771961 1.262393 -0.092305
C  0.094894 0.773625 -1.525998
C  4.550504 1.657802 1.216711
C  -2.315425 0.826547 -0.800734
C  -4.462624 1.13306 -0.257446
C  -3.389933 -0.695072 0.437963
C  -5.704216 1.953069 -0.342328
C  -2.25469 -2.625581 1.162868
H  -0.520788 -0.840849 -0.400024
H  4.041499 0.090028 -1.732037
H  3.265032 1.507123 2.930445
H  5.626367 1.634006 -0.64017
H  5.234652 2.339375 1.703874
H  -6.429214 1.636889 0.401961
H  -5.474931 3.009805 -0.219119
H  -6.151572 1.835682 -1.331081
H  -2.522996 -3.490669 1.761777
H  -1.425108 -2.101798 1.638916
H  -1.939937 -2.957948 0.173007
H  -1.317057 2.1787 -1.900535
totalener: -1897.71006916 hartree
nucrepener: 2362.24051890 hartree
electener: -4259.95058807 hartree
oneelecener: -7300.12225230 hartree
twoeener: 3040.17166423 hartree
kineticenergy: 1892.08671548 hartree
xcener: -136.562756357275 hartree
chargesum: 0.0000000
charge: -0.063216 0.849366 -0.429893 -0.451044 -0.358387 -0.231584 -0.232444 -0.159923 -0.369419 -0.425135 -0.298119 -0.030152 0.012595 -0.046436 -0.127941 -0.119157 0.335785 -0.113532 0.377960 0.257852 0.410365 -0.227500 -0.124824 0.202132 0.145697 0.124599 0.136154 0.135443 0.105783 0.100231 0.097816 0.129436 0.100651 0.113247 0.173596
qa: -0.0632 0.8494 -0.4299 -0.4510 -0.3584 -0.2316 -0.2324 -0.1599 -0.3694 -0.4251 -0.2981 -0.0302 0.0126 -0.0464 -0.1279 -0.1192 0.3358 -0.1135 0.3780 0.2579 0.4104 -0.2275 -0.1248 0.2021 0.1457 0.1246 0.1362 0.1354 0.1058 0.1002 0.0978 0.1294 0.1007 0.1132 0.1736
va: 1.2621 5.8752 2.0771 2.0355 2.1590 2.1743 3.0742 3.1837 3.0180 2.9617 3.0230 3.7850 4.0001 3.9377 4.0149 3.9576 4.4114 3.9653 4.2173 4.0209 4.2559 3.9084 3.8761 1.0666 1.0230 1.0102 0.9982 0.9963 1.0160 1.0090 1.0052 0.9981 0.9957 0.9943 1.0334
dispcorr: -0.018715335 hartree
energy: -1897.728784498197
dipole: -8.88566 8.67746 -0.20820 4.98965 -3.82880 1.16085 -0.43500 1.37275 0.93775
magnitude: 1.50675 au
magnitude: 3.82986 debye
