program: Orca
programVersion: 4.2.1
elementType: I S O O O O O O N N N N N C C C C C C C C C C C C C C H H H H H H H H H H H H H H
elementType: I
charge: 0
multiplicity: 1
keywords: wb97x-d3
keywords: def2-TZVPP
keywords: def2/J RIJCOSX GRIDX6 NOFINALGRIDX
keywords: grid4 nofinalgrid
keywords: scfconv7
keywords: smallprint printgap noloewdin
keywords: NOSOSCF
formula: C14H14IN5O6S
InChI: InChI=1S/C14H14IN5O6S/c1-7-16-12(19-14(17-7)26-3)18-13(22)20-27(23,24)10-6-8(15)4-5-9(10)11(21)25-2/h4-6,18,20H,1-3H3
41 atoms
I  5.051848 0.824718 -0.044043
S  -0.194536 -0.836693 1.427067
O  -0.824872 -2.144438 1.405294
O  0.410324 -0.349223 2.647412
O  -1.399838 -1.429529 -1.486909
O  -0.357729 -3.383347 -1.799702
O  -0.096869 2.018848 0.647201
O  -5.661658 -0.915534 0.530528
N  -1.40949 0.197977 0.968318
N  -2.270682 2.148711 0.046764
N  -4.356418 2.590805 -0.756711
N  -3.928227 0.543406 0.316045
N  -6.076042 1.001554 -0.518254
C  1.036506 -0.783719 0.145705
C  0.883515 -1.510655 -1.034806
C  2.220951 -0.126364 0.440362
C  1.956438 -1.572627 -1.912357
C  3.266355 -0.181211 -0.469151
C  3.141732 -0.906968 -1.642492
C  -0.355451 -2.230038 -1.454301
C  -1.181375 1.484383 0.571864
C  -3.56191 1.73516 -0.136168
C  -5.606827 2.172469 -0.931586
C  -5.197484 0.234106 0.103223
C  -2.63595 -1.981083 -1.953769
C  -6.535798 3.0632 -1.670224
C  -4.811412 -1.773937 1.29219
H  2.331707 0.409925 1.370952
H  -2.353399 -0.188114 0.839838
H  1.869855 -2.13718 -2.830608
H  3.9540 -0.968264 -2.35266
H  -2.067046 3.084856 -0.280888
H  -2.985878 -2.781292 -1.302779
H  -2.536501 -2.36118 -2.969242
H  -7.554933 2.959236 -1.305492
H  -6.226034 4.102906 -1.607103
H  -6.535842 2.778974 -2.725186
H  -4.440426 -1.276815 2.1874
H  -5.429617 -2.617737 1.581847
H  -3.97442 -2.14229 0.69917
H  -3.347854 -1.161911 -1.952934
elementType: I S O N C H
totalener: -1963.18974311 hartree
nucrepener: 3126.43325125 hartree
electener: -5089.62299435 hartree
oneelecener: -9018.77006545 hartree
twoeener: 3929.14707109 hartree
cpcmener: -0.05224773 hartree
kineticenergy: 1773.06455796 hartree
xcener: -151.126096142603 hartree
chargesum: -0.0000000
charge: 0.082174 0.893582 -0.514079 -0.500946 -0.261119 -0.444601 -0.466234 -0.272248 -0.184439 -0.127547 -0.401162 -0.435330 -0.366209 -0.167504 0.080844 0.003797 -0.192308 -0.053138 -0.115962 0.466026 0.382923 0.408817 0.330587 0.438712 -0.158274 -0.240064 -0.125217 0.133057 0.198904 0.152056 0.155558 0.198324 0.130094 0.144540 0.102449 0.099980 0.118583 0.132130 0.142202 0.100795 0.130246
qa: 0.0822 0.8936 -0.5141 -0.5009 -0.2611 -0.4446 -0.4662 -0.2722 -0.1844 -0.1275 -0.4012 -0.4353 -0.3662 -0.1675 0.0808 0.0038 -0.1923 -0.0531 -0.1160 0.4660 0.3829 0.4088 0.3306 0.4387 -0.1583 -0.2401 -0.1252 0.1331 0.1989 0.1521 0.1556 0.1983 0.1301 0.1445 0.1024 0.1000 0.1186 0.1321 0.1422 0.1008 0.1302
va: 1.2171 5.7922 1.9716 1.9984 2.1165 2.0559 2.0514 2.1350 3.0976 3.2182 3.0231 2.9231 3.0029 3.8955 3.6958 3.7927 4.0597 4.0532 3.9222 4.0806 4.3949 4.2025 3.9502 4.2412 3.8432 3.9304 3.8550 1.0317 1.0718 1.0066 0.9922 1.0144 0.9818 0.9999 1.0109 1.0137 0.9988 0.9892 0.9985 0.9799 0.9944
dispcorr: -0.025508460 hartree
energy: -1963.215251567785
dipole: -402.78426 401.30078 -1.48348 -57.51723 58.70063 1.18340 -11.78855 9.53915 -2.24940
magnitude: 2.94294 au
magnitude: 7.48037 debye
