program: Orca
programVersion: 4.2.1
elementType: I S O O O O O O N N N N N C C C C C C C C C C C C C C H H H H H H H H H H H H H H
elementType: I
charge: 0
multiplicity: 1
keywords: wb97x-d3
keywords: def2-TZVPP
keywords: def2/J RIJCOSX GRIDX6 NOFINALGRIDX
keywords: grid4 nofinalgrid
keywords: scfconv7
keywords: smallprint printgap noloewdin
keywords: NOSOSCF
formula: C14H14IN5O6S
InChI: InChI=1S/C14H14IN5O6S/c1-7-16-12(19-14(17-7)26-3)18-13(22)20-27(23,24)10-6-8(15)4-5-9(10)11(21)25-2/h4-6,18,20H,1-3H3
41 atoms
I  4.561884 -0.731969 -1.907468
S  0.465929 1.424767 1.440105
O  0.127575 1.153068 2.82464
O  1.288478 2.568217 1.113006
O  -0.092011 -2.181447 3.118065
O  -1.505798 -1.218878 1.675129
O  -0.154824 1.758564 -1.42079
O  -6.805117 0.420326 -1.374355
N  -1.002146 1.561803 0.677671
N  -2.383327 1.482202 -1.189039
N  -3.573583 1.097192 0.7691
N  -4.595231 0.962829 -1.341971
N  -5.830608 0.497206 0.616855
C  1.223507 -0.02924 0.755658
C  0.814317 -1.297406 1.165226
C  2.292853 0.146104 -0.107267
C  1.510311 -2.398599 0.689466
C  2.956377 -0.974026 -0.586219
C  2.572205 -2.244558 -0.189534
C  -0.394203 -1.535479 2.012216
C  -1.106145 1.611805 -0.684212
C  -3.55334 1.171145 -0.549118
C  -4.736006 0.7308 1.312446
C  -5.701546 0.641293 -0.701639
C  -1.177149 -2.534702 3.983811
C  -4.765568 0.589459 2.789363
C  -6.785968 0.524165 -2.798596
H  2.607189 1.138971 -0.393346
H  -1.858396 1.321946 1.207367
H  1.218189 -3.396282 0.9876
H  3.087295 -3.122954 -0.551707
H  -2.438104 1.526416 -2.198754
H  -0.723985 -3.01272 4.846215
H  -1.856794 -3.231835 3.49607
H  -3.959332 -0.068595 3.114921
H  -4.594749 1.559754 3.258037
H  -5.715917 0.194651 3.135549
H  -7.79774 0.296949 -3.120607
H  -6.521957 1.529955 -3.121822
H  -6.096941 -0.193886 -3.240772
H  -1.72739 -1.651716 4.306449
elementType: I S O N C H
totalener: -1963.19149282 hartree
nucrepener: 3083.81934978 hartree
electener: -5047.01084260 hartree
oneelecener: -8935.43380471 hartree
twoeener: 3888.42296211 hartree
cpcmener: -0.05025841 hartree
kineticenergy: 1773.06748443 hartree
xcener: -151.124962885367 hartree
chargesum: 0.0000000
charge: 0.079242 0.892843 -0.515548 -0.502932 -0.272461 -0.424094 -0.471071 -0.279949 -0.202250 -0.130391 -0.398496 -0.411266 -0.367677 -0.142043 0.067545 -0.011860 -0.181869 -0.047989 -0.122656 0.446593 0.377757 0.387831 0.320418 0.469535 -0.124484 -0.241302 -0.115177 0.136564 0.215553 0.151655 0.156179 0.197078 0.136423 0.124898 0.100400 0.116013 0.098925 0.133480 0.118552 0.119359 0.116672
qa: 0.0792 0.8928 -0.5155 -0.5029 -0.2725 -0.4241 -0.4711 -0.2799 -0.2022 -0.1304 -0.3985 -0.4113 -0.3677 -0.1420 0.0675 -0.0119 -0.1819 -0.0480 -0.1227 0.4466 0.3778 0.3878 0.3204 0.4695 -0.1245 -0.2413 -0.1152 0.1366 0.2156 0.1517 0.1562 0.1971 0.1364 0.1249 0.1004 0.1160 0.0989 0.1335 0.1186 0.1194 0.1167
va: 1.2142 5.8063 1.9728 1.9946 2.1410 2.0706 2.0423 2.1248 3.0834 3.2131 3.0123 2.9598 3.0198 3.8381 3.7107 3.8091 4.0599 4.0483 3.9194 4.0937 4.4021 4.2252 3.9307 4.2233 3.8555 3.9320 3.8422 1.0297 1.0749 1.0053 0.9921 1.0131 0.9941 0.9923 1.0065 1.0004 1.0206 0.9941 0.9947 0.9946 0.9904
dispcorr: -0.023211891 hartree
energy: -1963.214704708626
dipole: -365.65939 364.08929 -1.57010 46.08976 -48.90016 -2.81040 148.20598 -148.90958 -0.70360
magnitude: 3.29524 au
magnitude: 8.37584 debye
