program: Orca
programVersion: 4.2.1
elementType: I S O O O O O O N N N N N C C C C C C C C C C C C C C H H H H H H H H H H H H H H
elementType: I
charge: 0
multiplicity: 1
keywords: wb97x-d3
keywords: def2-TZVPP
keywords: def2/J RIJCOSX GRIDX6 NOFINALGRIDX
keywords: grid4 nofinalgrid
keywords: scfconv7
keywords: smallprint printgap noloewdin
keywords: NOSOSCF
formula: C14H14IN5O6S
InChI: InChI=1S/C14H14IN5O6S/c1-7-16-12(19-14(17-7)26-3)18-13(22)20-27(23,24)10-6-8(15)4-5-9(10)11(21)25-2/h4-6,18,20H,1-3H3
41 atoms
I  4.913204 0.787656 0.597746
S  0.022313 -0.645297 -1.978575
O  0.774963 0.049866 -2.999186
O  -0.536379 -1.954593 -2.26033
O  -0.524637 -3.622063 0.668505
O  -1.691191 -1.712902 0.644951
O  -0.093764 2.097764 -0.907779
O  -6.388665 2.071707 1.60775
N  -1.288703 0.271629 -1.536094
N  -2.280301 2.007216 -0.351405
N  -3.771547 0.261282 -0.709142
N  -4.324336 2.09607 0.649617
N  -5.844321 0.30872 0.376554
C  1.036325 -0.774992 -0.524512
C  0.680049 -1.636331 0.512221
C  2.239036 -0.087944 -0.516944
C  1.56677 -1.799606 1.565931
C  3.097389 -0.252717 0.560403
C  2.768637 -1.107953 1.59939
C  -0.64925 -2.314194 0.593951
C  -1.143156 1.491784 -0.937465
C  -3.49962 1.420193 -0.138125
C  -4.952849 -0.275726 -0.398267
C  -5.480216 1.497184 0.85676
C  -1.728228 -4.383607 0.821681
C  -5.253491 -1.607975 -0.978689
C  -6.104835 3.341152 2.197086
H  2.504732 0.557762 -1.340837
H  -2.201123 -0.20298 -1.420756
H  1.320591 -2.459744 2.386415
H  3.434288 -1.249753 2.438944
H  -2.145513 2.904821 0.096704
H  -1.423123 -5.424888 0.810336
H  -2.418231 -4.199383 -0.000824
H  -4.436219 -2.2982 -0.767684
H  -6.180328 -2.016001 -0.586994
H  -5.333944 -1.530148 -2.064019
H  -5.250699 3.285304 2.870306
H  -5.922892 4.101275 1.438888
H  -6.992852 3.604015 2.763942
H  -2.217896 -4.157654 1.767821
elementType: I S O N C H
totalener: -1963.19112633 hartree
nucrepener: 3091.44118909 hartree
electener: -5054.63231542 hartree
oneelecener: -8950.66321512 hartree
twoeener: 3896.03089970 hartree
cpcmener: -0.05022135 hartree
kineticenergy: 1773.06883277 hartree
xcener: -151.124727072137 hartree
chargesum: 0.0000000
charge: 0.079224 0.892770 -0.503380 -0.515602 -0.272943 -0.424363 -0.469960 -0.280046 -0.201890 -0.131865 -0.398857 -0.409793 -0.367246 -0.140085 0.068027 -0.016345 -0.180127 -0.044822 -0.124183 0.445968 0.376116 0.385274 0.321190 0.469620 -0.125117 -0.238181 -0.114779 0.137681 0.214688 0.152600 0.155656 0.197272 0.136571 0.117139 0.098069 0.098888 0.117260 0.119143 0.118340 0.133508 0.124580
qa: 0.0792 0.8928 -0.5034 -0.5156 -0.2729 -0.4244 -0.4700 -0.2800 -0.2019 -0.1319 -0.3989 -0.4098 -0.3672 -0.1401 0.0680 -0.0163 -0.1801 -0.0448 -0.1242 0.4460 0.3761 0.3853 0.3212 0.4696 -0.1251 -0.2382 -0.1148 0.1377 0.2147 0.1526 0.1557 0.1973 0.1366 0.1171 0.0981 0.0989 0.1173 0.1191 0.1183 0.1335 0.1246
va: 1.2141 5.8056 1.9938 1.9722 2.1405 2.0693 2.0434 2.1248 3.0795 3.2127 3.0100 2.9588 3.0185 3.8395 3.7080 3.8146 4.0572 4.0448 3.9196 4.0908 4.4039 4.2266 3.9342 4.2226 3.8586 3.9322 3.8423 1.0290 1.0760 1.0050 0.9920 1.0129 0.9942 0.9889 1.0065 1.0199 1.0006 0.9947 0.9949 0.9941 0.9921
dispcorr: -0.023421408 hartree
energy: -1963.214547742245
dipole: -392.01330 390.87834 -1.13496 -64.23053 63.74682 -0.48371 -34.37362 37.50797 3.13435
magnitude: 3.36842 au
magnitude: 8.56185 debye
