program: Orca
programVersion: 4.2.1
elementType: I S O O O O O O N N N N N C C C C C C C C C C C C C C H H H H H H H H H H H H H H
elementType: I
charge: 0
multiplicity: 1
keywords: wb97x-d3
keywords: def2-TZVPP
keywords: def2/J RIJCOSX GRIDX6 NOFINALGRIDX
keywords: grid4 nofinalgrid
keywords: scfconv7
keywords: smallprint printgap noloewdin
keywords: NOSOSCF
formula: C14H14IN5O6S
InChI: InChI=1S/C14H14IN5O6S/c1-7-16-12(19-14(17-7)26-3)18-13(22)20-27(23,24)10-6-8(15)4-5-9(10)11(21)25-2/h4-6,18,20H,1-3H3
41 atoms
I  4.866294 0.879843 0.590838
S  -0.0117 -0.708392 -1.924173
O  0.706726 -0.006205 -2.962843
O  -0.57256 -2.019016 -2.188056
O  -0.350934 -3.764768 0.679285
O  -1.631909 -1.931218 0.673464
O  -0.113762 2.067518 -0.917316
O  -6.456196 2.260279 1.47556
N  -1.307541 0.203656 -1.428912
N  -2.298925 2.010137 -0.354581
N  -3.79097 0.247651 -0.606672
N  -4.372266 2.193769 0.570774
N  -5.910192 0.414254 0.370605
C  1.041078 -0.82978 -0.496879
C  0.734848 -1.716175 0.534659
C  2.214486 -0.093366 -0.498359
C  1.640572 -1.849665 1.577025
C  3.092156 -0.231585 0.5667
C  2.811409 -1.106604 1.603524
C  -0.556843 -2.466771 0.614977
C  -1.160228 1.46009 -0.911645
C  -3.52762 1.451768 -0.131477
C  -4.999468 -0.239437 -0.320839
C  -5.541512 1.62455 0.786638
C  -1.502502 -4.602464 0.816009
C  -5.308883 -1.59951 -0.832308
C  -6.153087 3.553116 1.997833
H  2.440966 0.569333 -1.321093
H  -2.220409 -0.264461 -1.29588
H  1.433305 -2.528473 2.393614
H  3.492443 -1.225227 2.434864
H  -2.168497 2.937489 0.030109
H  -2.184694 -4.475161 -0.024375
H  -2.030556 -4.402014 1.748076
H  -4.498838 -2.286475 -0.585745
H  -6.242776 -1.975198 -0.423472
H  -5.387544 -1.576551 -1.920938
H  -5.309545 3.517838 2.686879
H  -5.940972 4.266926 1.202344
H  -7.04348 3.86709 2.535352
H  -1.127931 -5.621717 0.824509
elementType: I S O N C H
totalener: -1963.19245463 hartree
nucrepener: 3077.49527289 hartree
electener: -5040.68772751 hartree
oneelecener: -8922.66446862 hartree
twoeener: 3881.97674111 hartree
cpcmener: -0.04186899 hartree
kineticenergy: 1773.07139319 hartree
xcener: -151.123305201727 hartree
chargesum: 0.0000000
charge: 0.076485 0.882964 -0.489210 -0.504611 -0.268734 -0.411469 -0.449415 -0.270164 -0.200667 -0.136052 -0.398370 -0.412491 -0.360670 -0.147445 0.065626 -0.007621 -0.180676 -0.047255 -0.126162 0.437943 0.368885 0.386719 0.316096 0.461042 -0.124826 -0.243181 -0.116838 0.136223 0.213958 0.148925 0.152489 0.193497 0.117312 0.120732 0.099844 0.099942 0.115909 0.117779 0.117032 0.132643 0.133812
qa: 0.0765 0.8830 -0.4892 -0.5046 -0.2687 -0.4115 -0.4494 -0.2702 -0.2007 -0.1361 -0.3984 -0.4125 -0.3607 -0.1474 0.0656 -0.0076 -0.1807 -0.0473 -0.1262 0.4379 0.3689 0.3867 0.3161 0.4610 -0.1248 -0.2432 -0.1168 0.1362 0.2140 0.1489 0.1525 0.1935 0.1173 0.1207 0.0998 0.0999 0.1159 0.1178 0.1170 0.1326 0.1338
va: 1.2150 5.8235 2.0127 1.9867 2.1410 2.0838 2.0692 2.1348 3.0793 3.2077 3.0124 2.9589 3.0210 3.8515 3.7080 3.8085 4.0588 4.0479 3.9238 4.1067 4.4121 4.2247 3.9355 4.2337 3.8610 3.9317 3.8465 1.0302 1.0739 1.0067 0.9936 1.0157 0.9912 0.9930 1.0079 1.0190 1.0000 0.9950 0.9950 0.9941 0.9942
dispcorr: -0.022940457 hartree
energy: -1963.215395083031
dipole: -388.84266 387.82647 -1.01619 -70.52517 70.13812 -0.38705 -33.54507 36.43728 2.89221
magnitude: 3.08987 au
magnitude: 7.85384 debye
