program: Orca
programVersion: 4.2.1
elementType: I S O O O O O O N N N N N C C C C C C C C C C C C C C H H H H H H H H H H H H H H
elementType: I
charge: 0
multiplicity: 1
keywords: wb97x-d3
keywords: def2-TZVPP
keywords: def2/J RIJCOSX GRIDX6 NOFINALGRIDX
keywords: grid4 nofinalgrid
keywords: scfconv7
keywords: smallprint printgap noloewdin
keywords: NOSOSCF
formula: C14H14IN5O6S
InChI: InChI=1S/C14H14IN5O6S/c1-7-16-12(19-14(17-7)26-3)18-13(22)20-27(23,24)10-6-8(15)4-5-9(10)11(21)25-2/h4-6,18,20H,1-3H3
41 atoms
I  4.903329 0.814127 -0.549704
S  -0.11695 -0.646788 1.735394
O  -0.766627 -1.930203 1.913949
O  0.62157 -0.049144 2.824543
O  -0.557048 -3.49774 -1.199641
O  -1.729316 -1.614846 -0.915435
O  -0.041288 2.200715 0.919763
O  -5.548175 -0.841334 0.636481
N  -1.343544 0.375007 1.279057
N  -2.220482 2.313276 0.343366
N  -4.300322 2.740529 -0.479868
N  -3.847449 0.664029 0.521025
N  -5.98879 1.11028 -0.334179
C  0.961352 -0.747471 0.324855
C  0.64343 -1.55579 -0.767314
C  2.173379 -0.080962 0.403131
C  1.577002 -1.681609 -1.785764
C  3.078011 -0.206256 -0.641612
C  2.786436 -1.004616 -1.734763
C  -0.686092 -2.214059 -0.943702
C  -1.120675 1.658343 0.861556
C  -3.499156 1.880002 0.124613
C  -5.538358 2.303825 -0.69317
C  -5.103132 0.334198 0.269844
C  -1.752725 -4.235358 -1.476598
C  -6.468317 3.210796 -1.415824
C  -4.663362 -1.743722 1.302536
H  2.411673 0.519282 1.268984
H  -2.271998 -0.032739 1.110022
H  1.361843 -2.299878 -2.64679
H  3.486109 -1.114054 -2.551607
H  -2.028561 3.25707 0.030816
H  -2.408181 -4.259968 -0.606389
H  -1.429495 -5.245018 -1.711561
H  -7.505708 2.963788 -1.203673
H  -6.27697 4.251751 -1.163116
H  -6.312396 3.103106 -2.491975
H  -3.841065 -2.043067 0.653302
H  -4.272901 -1.316342 2.226206
H  -5.263311 -2.617105 1.542268
H  -2.289719 -3.818217 -2.327799
elementType: I S O N C H
totalener: -1963.19237004 hartree
nucrepener: 3107.04244030 hartree
electener: -5070.23481034 hartree
oneelecener: -8981.29380535 hartree
twoeener: 3911.05899501 hartree
cpcmener: -0.04073386 hartree
kineticenergy: 1773.06461491 hartree
xcener: -151.123353545534 hartree
chargesum: -0.0000000
charge: 0.078962 0.884728 -0.503237 -0.488045 -0.268890 -0.425932 -0.446646 -0.268988 -0.197062 -0.133698 -0.404777 -0.413881 -0.362963 -0.156702 0.072461 0.000626 -0.184953 -0.050593 -0.124571 0.452409 0.366952 0.392036 0.317657 0.447265 -0.124802 -0.239580 -0.121034 0.135787 0.219042 0.150480 0.152488 0.192952 0.119058 0.135651 0.099645 0.101729 0.115875 0.099551 0.121569 0.138534 0.120898
qa: 0.0790 0.8847 -0.5032 -0.4880 -0.2689 -0.4259 -0.4466 -0.2690 -0.1971 -0.1337 -0.4048 -0.4139 -0.3630 -0.1567 0.0725 0.0006 -0.1850 -0.0506 -0.1246 0.4524 0.3670 0.3920 0.3177 0.4473 -0.1248 -0.2396 -0.1210 0.1358 0.2190 0.1505 0.1525 0.1930 0.1191 0.1357 0.0996 0.1017 0.1159 0.0996 0.1216 0.1385 0.1209
va: 1.2174 5.8216 1.9879 2.0135 2.1462 2.0683 2.0732 2.1444 3.0980 3.2078 3.0159 2.9508 3.0071 3.8561 3.6846 3.8010 4.0650 4.0525 3.9263 4.0901 4.4152 4.2307 3.9651 4.2379 3.8589 3.9291 3.8521 1.0304 1.0511 1.0083 0.9936 1.0181 0.9893 0.9939 1.0140 1.0102 0.9992 0.9993 0.9927 0.9981 0.9941
dispcorr: -0.023936286 hartree
energy: -1963.216306324032
dipole: -391.05635 390.39955 -0.65681 -63.23157 62.19824 -1.03333 31.26407 -33.89209 -2.62803
magnitude: 2.89926 au
magnitude: 7.36932 debye
