program: Orca
programVersion: 4.2.1
elementType: I S O O O O O O N N N N N C C C C C C C C C C C C C C H H H H H H H H H H H H H H
elementType: I
charge: 0
multiplicity: 1
keywords: wb97x-d3
keywords: def2-TZVPP
keywords: def2/J RIJCOSX GRIDX6 NOFINALGRIDX
keywords: grid4 nofinalgrid
keywords: scfconv7
keywords: smallprint printgap noloewdin
keywords: NOSOSCF
formula: C14H14IN5O6S
InChI: InChI=1S/C14H14IN5O6S/c1-7-16-12(19-14(17-7)26-3)18-13(22)20-27(23,24)10-6-8(15)4-5-9(10)11(21)25-2/h4-6,18,20H,1-3H3
41 atoms
I  4.930905 0.83358 0.21423
S  -0.203386 -0.783065 -1.693948
O  0.446944 -0.229175 -2.859246
O  -0.860129 -2.073466 -1.769058
O  -0.389244 -3.591255 1.211912
O  -1.598244 -1.709908 1.133661
O  -0.080188 2.09222 -1.005409
O  -5.556445 -0.917099 -0.226076
N  -1.397707 0.251714 -1.181958
N  -2.228363 2.248729 -0.331178
N  -4.279324 2.749002 0.520866
N  -3.858434 0.592797 -0.310934
N  -5.969187 1.115018 0.577244
C  0.976015 -0.827366 -0.365964
C  0.747278 -1.616227 0.760352
C  2.164734 -0.136388 -0.538494
C  1.74795 -1.703469 1.716852
C  3.136503 -0.219008 0.448194
C  2.93617 -1.003124 1.572298
C  -0.55355 -2.298875 1.034781
C  -1.155651 1.558498 -0.859751
C  -3.498653 1.838501 -0.034271
C  -5.509316 2.335101 0.812508
C  -5.103218 0.287427 0.01393
C  -1.546864 -4.360342 1.553712
C  -6.416672 3.30924 1.474252
C  -4.689844 -1.877385 -0.832554
H  2.33188 0.450486 -1.429942
H  -2.316128 -0.145113 -0.945426
H  1.603422 -2.310851 2.600107
H  3.691535 -1.082247 2.341694
H  -2.023573 3.211587 -0.094472
H  -1.203022 -5.386695 1.646614
H  -2.304274 -4.303029 0.77198
H  -7.457478 3.012479 1.372752
H  -6.181199 3.356181 2.540027
H  -6.2778 4.310213 1.069837
H  -5.287367 -2.777161 -0.949406
H  -4.349214 -1.547744 -1.814215
H  -3.834866 -2.096276 -0.193882
H  -1.974055 -4.03299 2.501306
elementType: I S O N C H
totalener: -1963.19242491 hartree
nucrepener: 3103.14221971 hartree
electener: -5066.33464462 hartree
oneelecener: -8973.44787225 hartree
twoeener: 3907.11322762 hartree
cpcmener: -0.04072719 hartree
kineticenergy: 1773.06684169 hartree
xcener: -151.123596108207 hartree
chargesum: 0.0000000
charge: 0.077949 0.882174 -0.486346 -0.503863 -0.266593 -0.423128 -0.448549 -0.269630 -0.197730 -0.133577 -0.406422 -0.416107 -0.362499 -0.143642 0.070723 -0.005062 -0.182981 -0.050535 -0.125579 0.444461 0.370866 0.392121 0.317976 0.449663 -0.125143 -0.237747 -0.120342 0.135281 0.220224 0.149064 0.152760 0.192984 0.135535 0.117217 0.098322 0.114943 0.102616 0.138859 0.121520 0.097850 0.122370
qa: 0.0779 0.8822 -0.4863 -0.5039 -0.2666 -0.4231 -0.4485 -0.2696 -0.1977 -0.1336 -0.4064 -0.4161 -0.3625 -0.1436 0.0707 -0.0051 -0.1830 -0.0505 -0.1256 0.4445 0.3709 0.3921 0.3180 0.4497 -0.1251 -0.2377 -0.1203 0.1353 0.2202 0.1491 0.1528 0.1930 0.1355 0.1172 0.0983 0.1149 0.1026 0.1389 0.1215 0.0978 0.1224
va: 1.2168 5.8216 2.0160 1.9866 2.1446 2.0725 2.0714 2.1450 3.1000 3.2076 3.0148 2.9525 3.0083 3.8485 3.7013 3.8085 4.0633 4.0510 3.9260 4.1003 4.4106 4.2321 3.9659 4.2337 3.8607 3.9298 3.8518 1.0311 1.0490 1.0074 0.9934 1.0181 0.9940 0.9896 1.0155 0.9995 1.0090 0.9982 0.9927 1.0020 0.9931
dispcorr: -0.023916395 hartree
energy: -1963.216341306203
dipole: -390.74571 390.27785 -0.46787 -68.19276 67.25669 -0.93607 -7.05119 9.62650 2.57532
magnitude: 2.77982 au
magnitude: 7.06573 debye
