program: Orca
programVersion: 4.2.1
elementType: I S O O O O O O N N N N N C C C C C C C C C C C C C C H H H H H H H H H H H H H H
elementType: I
charge: 0
multiplicity: 1
keywords: wb97x-d3
keywords: def2-TZVPP
keywords: def2/J RIJCOSX GRIDX6 NOFINALGRIDX
keywords: grid4 nofinalgrid
keywords: scfconv7
keywords: smallprint printgap noloewdin
keywords: NOSOSCF
formula: C14H14IN5O6S
InChI: InChI=1S/C14H14IN5O6S/c1-7-16-12(19-14(17-7)26-3)18-13(22)20-27(23,24)10-6-8(15)4-5-9(10)11(21)25-2/h4-6,18,20H,1-3H3
41 atoms
I  4.962359 0.806094 0.187335
S  -0.20581 -0.778331 -1.664349
O  0.416505 -0.198655 -2.832571
O  -0.863814 -2.067532 -1.749809
O  -0.329083 -3.670744 1.11409
O  -1.532455 -1.785321 1.190951
O  -0.085304 2.098321 -0.969342
O  -5.564819 -0.911925 -0.181634
N  -1.387959 0.243379 -1.102669
N  -2.235327 2.253842 -0.302096
N  -4.313974 2.784113 0.458325
N  -3.86159 0.594003 -0.264406
N  -6.006207 1.152825 0.514045
C  1.001638 -0.850795 -0.365282
C  0.798041 -1.673617 0.741336
C  2.184033 -0.150301 -0.541009
C  1.816671 -1.78554 1.675758
C  3.17588 -0.259815 0.423193
C  2.99963 -1.07641 1.528302
C  -0.495249 -2.37066 1.018004
C  -1.156308 1.559198 -0.811828
C  -3.513061 1.850538 -0.030568
C  -5.553636 2.38323 0.717432
C  -5.120642 0.3026 0.023879
C  -1.477616 -4.458023 1.446463
C  -6.497379 3.373856 1.2991
C  -4.674169 -1.900948 -0.700316
H  2.331446 0.463037 -1.418181
H  -2.305034 -0.155629 -0.865642
H  1.691078 -2.419281 2.543625
H  3.770482 -1.17622 2.279867
H  -2.039784 3.225178 -0.093464
H  -1.134492 -5.488548 1.464492
H  -2.259498 -4.352163 0.693879
H  -6.603346 3.18926 2.370497
H  -6.137194 4.39068 1.165004
H  -7.486933 3.273192 0.856377
H  -4.296274 -1.624627 -1.684942
H  -3.843815 -2.082639 -0.018674
H  -5.266234 -2.80739 -0.790736
H  -1.872568 -4.188597 2.426171
elementType: I S O N C H
totalener: -1963.19252125 hartree
nucrepener: 3096.40317954 hartree
electener: -5059.59570079 hartree
oneelecener: -8959.94979683 hartree
twoeener: 3900.35409603 hartree
cpcmener: -0.04080202 hartree
kineticenergy: 1773.05906937 hartree
xcener: -151.122101794522 hartree
chargesum: -0.0000000
charge: 0.077737 0.879757 -0.485187 -0.502834 -0.265602 -0.422822 -0.448786 -0.270667 -0.196829 -0.134033 -0.401109 -0.418852 -0.368385 -0.137286 0.069872 -0.006793 -0.183115 -0.051914 -0.124575 0.439500 0.373193 0.400703 0.319601 0.441806 -0.125287 -0.237975 -0.122934 0.135119 0.220244 0.149364 0.152815 0.193355 0.135275 0.116448 0.114413 0.097331 0.104469 0.119663 0.102632 0.138567 0.123116
qa: 0.0777 0.8798 -0.4852 -0.5028 -0.2656 -0.4228 -0.4488 -0.2707 -0.1968 -0.1340 -0.4011 -0.4189 -0.3684 -0.1373 0.0699 -0.0068 -0.1831 -0.0519 -0.1246 0.4395 0.3732 0.4007 0.3196 0.4418 -0.1253 -0.2380 -0.1229 0.1351 0.2202 0.1494 0.1528 0.1934 0.1353 0.1164 0.1144 0.0973 0.1045 0.1197 0.1026 0.1386 0.1231
va: 1.2166 5.8239 2.0181 1.9871 2.1441 2.0746 2.0713 2.1443 3.1022 3.2092 3.0221 2.9537 2.9987 3.8442 3.7072 3.8123 4.0628 4.0501 3.9240 4.1068 4.4090 4.2150 3.9643 4.2488 3.8598 3.9260 3.8511 1.0310 1.0473 1.0065 0.9934 1.0180 0.9942 0.9904 1.0004 1.0162 1.0085 0.9931 1.0031 0.9982 0.9929
dispcorr: -0.023798896 hartree
energy: -1963.216320144856
dipole: -392.04794 391.61279 -0.43515 -67.59256 66.57472 -1.01784 -6.16064 8.66083 2.50019
magnitude: 2.73428 au
magnitude: 6.94999 debye
