program: Orca
programVersion: 4.2.1
elementType: I S O O O O O O N N N N N C C C C C C C C C C C C C C H H H H H H H H H H H H H H
elementType: I
charge: 0
multiplicity: 1
keywords: wb97x-d3
keywords: def2-TZVPP
keywords: def2/J RIJCOSX GRIDX6 NOFINALGRIDX
keywords: grid4 nofinalgrid
keywords: scfconv7
keywords: smallprint printgap noloewdin
keywords: NOSOSCF
formula: C14H14IN5O6S
InChI: InChI=1S/C14H14IN5O6S/c1-7-16-12(19-14(17-7)26-3)18-13(22)20-27(23,24)10-6-8(15)4-5-9(10)11(21)25-2/h4-6,18,20H,1-3H3
41 atoms
I  4.410161 -0.77643 -2.056585
S  0.451999 1.40953 1.434644
O  0.116221 1.162183 2.818548
O  1.26001 2.53596 1.048719
O  0.104298 -2.26272 3.252039
O  -1.399719 -1.242777 1.948603
O  -0.200315 1.752419 -1.458955
O  -6.872185 0.608409 -1.478538
N  -1.020178 1.481714 0.652749
N  -2.427463 1.519296 -1.202616
N  -3.623108 0.99574 0.718825
N  -4.652345 1.081081 -1.392784
N  -5.902266 0.48262 0.519328
C  1.2144 -0.064413 0.777466
C  0.882835 -1.325254 1.27023
C  2.221248 0.1057 -0.158711
C  1.604152 -2.419584 0.812636
C  2.902361 -1.009504 -0.622178
C  2.603984 -2.271386 -0.135637
C  -0.27097 -1.569906 2.190149
C  -1.125598 1.597546 -0.705926
C  -3.601025 1.189774 -0.58783
C  -4.80044 0.624713 1.225659
C  -5.768679 0.735081 -0.780607
C  -0.911283 -2.582542 4.197498
C  -4.84106 0.359581 2.690354
C  -6.821624 0.854038 -2.876249
H  2.463602 1.097654 -0.511421
H  -1.859652 1.209163 1.18146
H  1.380427 -3.408605 1.189238
H  3.14281 -3.141594 -0.483494
H  -2.484914 1.624843 -2.204876
H  -1.696864 -3.193595 3.752167
H  -1.356411 -1.67913 4.614143
H  -5.806726 -0.039192 2.986021
H  -4.047811 -0.33782 2.959708
H  -4.653473 1.282757 3.240726
H  -7.832839 0.69076 -3.238187
H  -6.516094 1.877462 -3.094595
H  -6.138172 0.170838 -3.380876
H  -0.417007 -3.141606 4.986608
totalener: -1963.16345289 hartree
nucrepener: 3067.64446159 hartree
electener: -5030.80791448 hartree
oneelecener: -8902.15245312 hartree
twoeener: 3871.34453864 hartree
kineticenergy: 1773.11257064 hartree
xcener: -151.120914059192 hartree
chargesum: 0.0000000
charge: 0.076315 0.867931 -0.460121 -0.427285 -0.255229 -0.375499 -0.371330 -0.233954 -0.210806 -0.165805 -0.391437 -0.401999 -0.298753 -0.196482 0.080840 0.018255 -0.168613 -0.065822 -0.119040 0.410162 0.344673 0.377371 0.278057 0.413081 -0.139614 -0.241689 -0.127751 0.141936 0.211712 0.123609 0.129559 0.169852 0.111298 0.118594 0.106670 0.100647 0.100134 0.125417 0.109961 0.109774 0.125379
qa: 0.0763 0.8679 -0.4601 -0.4273 -0.2552 -0.3755 -0.3713 -0.2340 -0.2108 -0.1658 -0.3914 -0.4020 -0.2988 -0.1965 0.0808 0.0183 -0.1686 -0.0658 -0.1190 0.4102 0.3447 0.3774 0.2781 0.4131 -0.1396 -0.2417 -0.1278 0.1419 0.2117 0.1236 0.1296 0.1699 0.1113 0.1186 0.1067 0.1006 0.1001 0.1254 0.1100 0.1098 0.1254
va: 1.2351 5.8450 2.0368 2.0847 2.1422 2.1193 2.1435 2.1618 3.1004 3.1867 3.0130 2.9660 3.0322 3.9572 3.7058 3.7972 4.0798 4.0934 3.9478 4.1315 4.4045 4.2135 3.9640 4.2650 3.8854 3.9119 3.8755 1.0266 1.0669 1.0180 1.0045 1.0342 0.9931 0.9933 1.0188 1.0102 1.0047 0.9948 0.9963 0.9963 0.9954
dispcorr: -0.022667184 hartree
energy: -1963.186120075709
dipole: -356.28648 355.06256 -1.22392 48.51246 -50.32062 -1.80815 157.34339 -157.65699 -0.31360
magnitude: 2.20584 au
magnitude: 5.60679 debye
