program: Orca
programVersion: 4.2.1
elementType: I S O O O O O O N N N N N C C C C C C C C C C C C C C H H H H H H H H H H H H H H
elementType: I
charge: 0
multiplicity: 1
keywords: wb97x-d3
keywords: def2-TZVPP
keywords: def2/J RIJCOSX GRIDX6 NOFINALGRIDX
keywords: grid4 nofinalgrid
keywords: scfconv7
keywords: smallprint printgap noloewdin
keywords: NOSOSCF
formula: C14H14IN5O6S
InChI: InChI=1S/C14H14IN5O6S/c1-7-16-12(19-14(17-7)26-3)18-13(22)20-27(23,24)10-6-8(15)4-5-9(10)11(21)25-2/h4-6,18,20H,1-3H3
41 atoms
I  4.774695 0.925867 0.800196
S  -0.016415 -0.5522 -1.929273
O  0.716373 0.248945 -2.873881
O  -0.57214 -1.834343 -2.298523
O  -0.288048 -3.876649 0.487361
O  -1.62573 -2.084848 0.471372
O  -0.158524 2.18566 -0.743756
O  -6.542658 2.33999 1.503786
N  -1.316963 0.316139 -1.348576
N  -2.354985 2.086846 -0.247312
N  -3.824271 0.305727 -0.497149
N  -4.443626 2.268126 0.638857
N  -5.958327 0.464951 0.460649
C  1.017394 -0.79035 -0.493521
C  0.740159 -1.791631 0.435839
C  2.163981 -0.017748 -0.404581
C  1.655167 -2.012213 1.456202
C  3.046339 -0.242942 0.640877
C  2.801101 -1.240883 1.56907
C  -0.532507 -2.577864 0.440332
C  -1.183685 1.557761 -0.791483
C  -3.579678 1.520567 -0.039514
C  -5.029369 -0.187569 -0.20545
C  -5.610587 1.689622 0.848982
C  -1.420195 -4.739898 0.510117
C  -5.314452 -1.57047 -0.677775
C  -6.252614 3.646769 1.97668
H  2.358177 0.741451 -1.148266
H  -2.206815 -0.182444 -1.214253
H  1.474097 -2.792273 2.183255
H  3.491822 -1.426465 2.379633
H  -2.236145 3.007952 0.148296
H  -2.054194 -4.550021 1.376452
H  -1.022972 -5.749393 0.56232
H  -5.337524 -1.593579 -1.768292
H  -4.513119 -2.238716 -0.362662
H  -6.267974 -1.922568 -0.295985
H  -7.156381 3.983759 2.47642
H  -5.423715 3.643055 2.684923
H  -6.010672 4.327618 1.160495
H  -2.013913 -4.628056 -0.397014
totalener: -1963.16335114 hartree
nucrepener: 3066.99605720 hartree
electener: -5030.15940835 hartree
oneelecener: -8900.86144116 hartree
twoeener: 3870.70203282 hartree
kineticenergy: 1773.11611939 hartree
xcener: -151.121537265551 hartree
chargesum: -0.0000000
charge: 0.076512 0.865745 -0.427543 -0.459831 -0.255538 -0.375140 -0.371545 -0.233816 -0.209906 -0.165326 -0.391725 -0.401513 -0.298266 -0.195134 0.078871 0.018537 -0.165722 -0.063174 -0.121582 0.409650 0.344628 0.376108 0.279111 0.412719 -0.138955 -0.242457 -0.127233 0.140654 0.212165 0.123649 0.129175 0.169726 0.110506 0.125077 0.101074 0.100730 0.106127 0.125558 0.109245 0.109627 0.119212
qa: 0.0765 0.8657 -0.4275 -0.4598 -0.2555 -0.3751 -0.3715 -0.2338 -0.2099 -0.1653 -0.3917 -0.4015 -0.2983 -0.1951 0.0789 0.0185 -0.1657 -0.0632 -0.1216 0.4097 0.3446 0.3761 0.2791 0.4127 -0.1390 -0.2425 -0.1272 0.1407 0.2122 0.1236 0.1292 0.1697 0.1105 0.1251 0.1011 0.1007 0.1061 0.1256 0.1092 0.1096 0.1192
va: 1.2347 5.8454 2.0839 2.0369 2.1411 2.1187 2.1437 2.1615 3.0998 3.1868 3.0125 2.9658 3.0323 3.9622 3.7070 3.7985 4.0771 4.0898 3.9508 4.1301 4.4052 4.2151 3.9647 4.2640 3.8852 3.9133 3.8757 1.0271 1.0662 1.0182 1.0047 1.0342 0.9937 0.9954 1.0044 1.0100 1.0187 0.9947 0.9965 0.9964 0.9930
dispcorr: -0.022633268 hartree
energy: -1963.185984410549
dipole: -384.56743 383.63506 -0.93237 -71.63535 71.14162 -0.49373 -45.88364 47.83710 1.95346
magnitude: 2.22015 au
magnitude: 5.64318 debye
