program: Orca
programVersion: 4.2.1
elementType: I S O O O O O O N N N N N C C C C C C C C C C C C C C H H H H H H H H H H H H H H
elementType: I
charge: 0
multiplicity: 1
keywords: wb97x-d3
keywords: def2-TZVPP
keywords: def2/J RIJCOSX GRIDX6 NOFINALGRIDX
keywords: grid4 nofinalgrid
keywords: scfconv7
keywords: smallprint printgap noloewdin
keywords: NOSOSCF
formula: C14H14IN5O6S
InChI: InChI=1S/C14H14IN5O6S/c1-7-16-12(19-14(17-7)26-3)18-13(22)20-27(23,24)10-6-8(15)4-5-9(10)11(21)25-2/h4-6,18,20H,1-3H3
41 atoms
I  4.696463 0.879923 1.088103
S  -0.025665 -0.225569 -1.931443
O  0.723935 0.692975 -2.747076
O  -0.577543 -1.443677 -2.479789
O  -0.330661 -3.855318 -0.008212
O  -1.66884 -2.077293 0.211874
O  -0.183443 2.334624 -0.400231
O  -6.595487 2.204852 1.769348
N  -1.334183 0.561687 -1.259486
N  -2.383796 2.169941 0.058902
N  -3.842713 0.427704 -0.42064
N  -4.484346 2.239544 0.932259
N  -5.987211 0.463827 0.526332
C  0.983995 -0.659542 -0.524673
C  0.695672 -1.783427 0.247639
C  2.122146 0.098626 -0.303002
C  1.592611 -2.143219 1.244247
C  2.98355 -0.266431 0.720276
C  2.728375 -1.388215 1.491249
C  -0.575149 -2.562536 0.123287
C  -1.207139 1.718466 -0.540666
C  -3.608713 1.579819 0.181868
C  -5.04804 -0.101615 -0.202341
C  -5.651338 1.636872 1.057643
C  -1.462764 -4.713587 -0.104186
C  -5.321024 -1.420909 -0.836163
C  -6.323545 3.457341 2.380006
H  2.32519 0.95624 -0.927796
H  -2.221347 0.045218 -1.189799
H  1.403588 -3.019754 1.849164
H  3.404867 -1.684141 2.280799
H  -2.272053 3.03383 0.568853
H  -2.086361 -4.656665 0.788334
H  -1.06526 -5.718966 -0.20833
H  -5.33515 -1.31554 -1.921974
H  -4.518827 -2.1181 -0.594759
H  -6.275874 -1.819158 -0.506729
H  -6.090165 4.22402 1.640838
H  -7.232659 3.727351 2.909742
H  -5.49547 3.390352 3.085967
H  -2.067637 -4.468412 -0.976989
totalener: -1963.16354879 hartree
nucrepener: 3067.59306687 hartree
electener: -5030.75661565 hartree
oneelecener: -8902.04773844 hartree
twoeener: 3871.29112279 hartree
kineticenergy: 1773.11417887 hartree
xcener: -151.121340247607 hartree
chargesum: -0.0000000
charge: 0.076760 0.866906 -0.426705 -0.459877 -0.255655 -0.376317 -0.371000 -0.233911 -0.210158 -0.165905 -0.390886 -0.401734 -0.298674 -0.195586 0.082311 0.017074 -0.168846 -0.068370 -0.117070 0.410893 0.344288 0.376520 0.277954 0.413200 -0.138768 -0.242146 -0.126880 0.142083 0.211337 0.123396 0.128889 0.169996 0.110874 0.125509 0.100958 0.100848 0.106242 0.109630 0.125266 0.109194 0.118359
qa: 0.0768 0.8669 -0.4267 -0.4599 -0.2557 -0.3763 -0.3710 -0.2339 -0.2102 -0.1659 -0.3909 -0.4017 -0.2987 -0.1956 0.0823 0.0171 -0.1688 -0.0684 -0.1171 0.4109 0.3443 0.3765 0.2780 0.4132 -0.1388 -0.2421 -0.1269 0.1421 0.2113 0.1234 0.1289 0.1700 0.1109 0.1255 0.1010 0.1008 0.1062 0.1096 0.1253 0.1092 0.1184
va: 1.2358 5.8460 2.0847 2.0371 2.1418 2.1189 2.1437 2.1616 3.0985 3.1869 3.0128 2.9662 3.0320 3.9557 3.7039 3.7992 4.0809 4.0964 3.9467 4.1306 4.4049 4.2139 3.9663 4.2645 3.8855 3.9125 3.8758 1.0264 1.0675 1.0182 1.0046 1.0342 0.9933 0.9954 1.0044 1.0104 1.0187 0.9965 0.9948 0.9966 0.9932
dispcorr: -0.022668272 hartree
energy: -1963.186217058148
dipole: -382.08603 381.12599 -0.96004 -65.17559 64.42716 -0.74843 -63.02630 64.88087 1.85458
magnitude: 2.21840 au
magnitude: 5.63872 debye
