program: Orca
programVersion: 4.2.1
elementType: S O O O O O O N N N N N N C C C C C C C C C C C C C C C H H H H H H H H H H H H H H H H H H
charge: 0
multiplicity: 1
keywords: wb97x-d3
keywords: def2-TZVPP
keywords: def2/J RIJCOSX GRIDX6 NOFINALGRIDX
keywords: grid4 nofinalgrid
keywords: scfconv7
keywords: smallprint printgap noloewdin
keywords: NOSOSCF
formula: C15H18N6O6S
InChI: InChI=1S/C15H18N6O6S/c1-4-27-15-19-12(16-2)17-13(20-15)18-14(23)21-28(24,25)10-8-6-5-7-9(10)11(22)26-3/h5-8,16,18,21H,4H2,1-3H3
46 atoms
S  1.357242 0.818861 0.440156
O  1.494104 1.222121 1.82697
O  1.284488 1.821865 -0.604765
O  4.013881 2.083897 0.836987
O  4.861855 0.895746 2.535354
O  -3.409829 1.409475 -2.15967
O  0.334732 -1.537217 1.924703
N  -0.046447 -0.04555 0.253017
N  -1.71798 -1.483548 0.985438
N  -3.913486 -1.575589 0.405341
N  -2.494836 -0.009592 -0.631577
N  -4.770614 -0.068797 -1.218824
N  -6.121611 -1.607211 -0.234287
C  2.633428 -0.367419 0.084734
C  3.892587 -0.223321 0.670232
C  2.348017 -1.449865 -0.730986
C  4.845377 -1.210129 0.460979
C  3.322714 -2.411097 -0.956114
C  4.563763 -2.298093 -0.352036
C  4.296012 0.965387 1.473665
C  -0.420488 -1.044086 1.115214
C  -2.74983 -0.998526 0.217334
C  -4.908812 -1.080885 -0.346052
C  -3.555912 0.41504 -1.311274
C  -2.118326 2.021737 -2.321805
C  4.255926 3.317669 1.519816
C  -2.270279 3.144028 -3.315585
C  -6.510607 -2.681254 0.646051
H  1.372815 -1.56767 -1.182703
H  -0.76891 0.318269 -0.391123
H  5.821425 -1.116723 0.917617
H  3.0989 -3.254706 -1.593624
H  5.319128 -3.054316 -0.514036
H  -1.768892 2.404306 -1.360849
H  -1.402679 1.280081 -2.681822
H  -6.839639 -1.190524 -0.805205
H  3.699144 3.365707 2.454586
H  5.317801 3.455753 1.717583
H  3.908579 4.099095 0.851614
H  -2.610006 2.781021 -4.285472
H  -2.966952 3.903555 -2.961113
H  -1.301559 3.621413 -3.459137
H  -5.64019 -3.108872 1.130164
H  -7.010759 -3.466239 0.08138
H  -7.194376 -2.325095 1.416447
H  -1.964538 -2.238565 1.612364
elementType: S O N C H
totalener: -1760.72972025 hartree
nucrepener: 2944.63375318 hartree
electener: -4705.36347343 hartree
oneelecener: -8267.24878986 hartree
twoeener: 3561.88531643 hartree
cpcmener: -0.06222680 hartree
kineticenergy: 1754.37136654 hartree
xcener: -145.159447481056 hartree
chargesum: -0.0000000
charge: 0.896931 -0.502665 -0.516861 -0.266788 -0.453679 -0.288064 -0.469445 -0.237248 -0.133630 -0.444835 -0.455874 -0.407145 -0.161783 -0.146507 0.106570 -0.030520 -0.210037 -0.176115 -0.090919 0.471096 0.379684 0.382622 0.393904 0.423870 0.047937 -0.128777 -0.267698 -0.149917 0.156089 0.224571 0.150980 0.169374 0.169683 0.092375 0.105651 0.177856 0.121135 0.128228 0.132130 0.091833 0.091414 0.092217 0.111096 0.114340 0.112888 0.194032
qa: 0.8969 -0.5027 -0.5169 -0.2668 -0.4537 -0.2881 -0.4694 -0.2372 -0.1336 -0.4448 -0.4559 -0.4071 -0.1618 -0.1465 0.1066 -0.0305 -0.2100 -0.1761 -0.0909 0.4711 0.3797 0.3826 0.3939 0.4239 0.0479 -0.1288 -0.2677 -0.1499 0.1561 0.2246 0.1510 0.1694 0.1697 0.0924 0.1057 0.1779 0.1211 0.1282 0.1321 0.0918 0.0914 0.0922 0.1111 0.1143 0.1129 0.1940
va: 5.7594 1.9707 1.9579 2.1252 2.0475 2.1190 2.0431 3.0973 3.2031 2.9845 2.9240 2.9589 3.2300 3.8295 3.6200 3.8007 4.0352 3.9570 3.8839 4.0892 4.4066 4.2468 4.2244 4.2819 3.7974 3.8470 3.9881 3.8733 1.0048 1.0586 1.0092 0.9870 0.9850 0.9970 0.9884 1.0119 0.9958 0.9935 0.9943 1.0032 1.0029 1.0051 1.0165 0.9917 0.9902 1.0160
dispcorr: -0.023374096 hartree
energy: -1760.753094345355
dipole: -10.03557 7.78343 -2.25215 3.26483 -5.08518 -1.82035 -9.71757 7.21224 -2.50532
magnitude: 3.82916 au
magnitude: 9.73296 debye
