program: Orca
programVersion: 4.2.1
elementType: S O O O O O O N N N N N N C C C C C C C C C C C C C C C H H H H H H H H H H H H H H H H H H
charge: 0
multiplicity: 1
keywords: wb97x-d3
keywords: def2-TZVPP
keywords: def2/J RIJCOSX GRIDX6 NOFINALGRIDX
keywords: grid4 nofinalgrid
keywords: scfconv7
keywords: smallprint printgap noloewdin
keywords: NOSOSCF
formula: C15H18N6O6S
InChI: InChI=1S/C15H18N6O6S/c1-4-27-15-19-12(16-2)17-13(20-15)18-14(23)21-28(24,25)10-8-6-5-7-9(10)11(22)26-3/h5-8,16,18,21H,4H2,1-3H3
46 atoms
S  1.342843 0.904961 0.551868
O  1.530079 1.280161 1.940051
O  1.26879 1.925829 -0.475212
O  4.049325 2.08547 0.894549
O  4.912008 0.83598 2.540783
O  -3.35752 1.338089 -2.261981
O  0.280904 -1.419172 2.056073
N  -0.089645 0.084263 0.392162
N  -1.749404 -1.39212 1.069702
N  -3.910565 -1.563093 0.389157
N  -2.486725 0.012948 -0.626291
N  -4.723048 -0.144397 -1.33641
N  -6.07525 -1.682964 -0.337141
C  2.573969 -0.310413 0.13762
C  3.85552 -0.212689 0.682384
C  2.23203 -1.367541 -0.689535
C  4.77354 -1.219365 0.419152
C  3.171874 -2.348845 -0.968876
C  4.435637 -2.281122 -0.406886
C  4.317885 0.945631 1.498117
C  -0.463204 -0.932134 1.232888
C  -2.7548 -0.956967 0.240049
C  -4.877278 -1.121587 -0.429031
C  -3.519995 0.374691 -1.381768
C  -2.084109 1.997137 -2.37326
C  4.353463 3.296259 1.593488
C  -2.216553 3.05655 -3.436378
C  -6.414291 -2.726896 0.599914
H  1.239696 -1.450924 -1.110474
H  -0.791727 0.425316 -0.284985
H  5.766666 -1.161942 0.843591
H  2.903494 -3.171786 -1.616056
H  5.164664 -3.052431 -0.612169
H  -1.816388 2.444625 -1.414142
H  -1.315998 1.270716 -2.64553
H  -6.79235 -1.330274 -0.948857
H  4.021277 4.102566 0.947494
H  3.819837 3.347584 2.541623
H  5.423871 3.390742 1.769483
H  -1.262277 3.571053 -3.543631
H  -2.4740 2.626075 -4.403896
H  -2.968224 3.799767 -3.171282
H  -7.455443 -2.991856 0.443118
H  -6.297989 -2.401427 1.633302
H  -5.809917 -3.620449 0.448796
H  -2.003709 -2.14349 1.697969
elementType: S O N C H
totalener: -1760.73116837 hartree
nucrepener: 2946.05699985 hartree
electener: -4706.78816822 hartree
oneelecener: -8270.00190326 hartree
twoeener: 3563.21373504 hartree
cpcmener: -0.06310557 hartree
kineticenergy: 1754.37161155 hartree
xcener: -145.158108920697 hartree
chargesum: 0.0000000
charge: 0.892149 -0.502025 -0.515523 -0.266319 -0.453550 -0.287624 -0.468955 -0.231429 -0.130707 -0.443504 -0.455360 -0.403081 -0.177779 -0.151046 0.108382 -0.025553 -0.210838 -0.179142 -0.089235 0.470450 0.376010 0.380269 0.405592 0.426145 0.047390 -0.128674 -0.268098 -0.153951 0.155645 0.223723 0.150622 0.169236 0.170108 0.096650 0.101948 0.180591 0.132427 0.121372 0.127635 0.092354 0.092001 0.091590 0.119401 0.109094 0.107808 0.193802
qa: 0.8921 -0.5020 -0.5155 -0.2663 -0.4536 -0.2876 -0.4690 -0.2314 -0.1307 -0.4435 -0.4554 -0.4031 -0.1778 -0.1510 0.1084 -0.0256 -0.2108 -0.1791 -0.0892 0.4704 0.3760 0.3803 0.4056 0.4261 0.0474 -0.1287 -0.2681 -0.1540 0.1556 0.2237 0.1506 0.1692 0.1701 0.0967 0.1019 0.1806 0.1324 0.1214 0.1276 0.0924 0.0920 0.0916 0.1194 0.1091 0.1078 0.1938
va: 5.7655 1.9718 1.9587 2.1256 2.0477 2.1204 2.0425 3.0985 3.2027 2.9738 2.9216 2.9703 3.2198 3.8356 3.6235 3.7952 4.0386 3.9613 3.8820 4.0901 4.4095 4.2558 4.2151 4.2789 3.7995 3.8471 3.9883 3.8904 1.0056 1.0582 1.0093 0.9872 0.9848 0.9946 0.9889 1.0118 0.9942 0.9957 0.9938 1.0051 1.0032 1.0029 0.9961 0.9948 0.9952 1.0165
dispcorr: -0.023433138 hartree
energy: -1760.754601507304
dipole: -9.72882 7.43716 -2.29167 2.71758 -4.51910 -1.80152 -10.34707 7.72044 -2.62663
magnitude: 3.92382 au
magnitude: 9.97357 debye
