program: Orca
programVersion: 4.2.1
elementType: S O O O O O O N N N N N N C C C C C C C C C C C C C C C H H H H H H H H H H H H H H H H H H
charge: 0
multiplicity: 1
keywords: wb97x-d3
keywords: def2-TZVPP
keywords: def2/J RIJCOSX GRIDX6 NOFINALGRIDX
keywords: grid4 nofinalgrid
keywords: scfconv7
keywords: smallprint printgap noloewdin
keywords: NOSOSCF
formula: C15H18N6O6S
InChI: InChI=1S/C15H18N6O6S/c1-4-27-15-19-12(16-2)17-13(20-15)18-14(23)21-28(24,25)10-8-6-5-7-9(10)11(22)26-3/h5-8,16,18,21H,4H2,1-3H3
46 atoms
S  1.674121 0.441981 -0.326283
O  1.966403 1.612396 0.480961
O  1.613771 0.554909 -1.770955
O  4.454791 1.313048 -0.854975
O  5.319085 1.409611 1.209128
O  -5.995093 -0.098455 0.918879
O  0.561036 -0.306025 2.321741
N  0.18095 -0.155198 0.085614
N  -1.571155 -0.430892 1.587589
N  -2.337691 -0.088392 -0.573306
N  -3.816351 -0.279344 1.249331
N  -4.664022 0.129297 -0.918716
N  -3.182431 0.315695 -2.65367
C  2.796922 -0.848064 0.159713
C  4.106394 -0.519623 0.514717
C  2.344773 -2.15458 0.234992
C  4.940198 -1.51889 0.994879
C  3.20211 -3.147709 0.68606
C  4.49132 -2.828673 1.077674
C  4.681745 0.845849 0.356211
C  -0.216735 -0.287573 1.392835
C  -2.613472 -0.259094 0.707225
C  -3.400585 0.115227 -1.362098
C  -4.798026 -0.075449 0.371482
C  -7.154496 0.226667 0.134745
C  4.850658 2.658122 -1.136824
C  -7.345111 1.719359 0.008141
C  -1.864916 0.362817 -3.242988
H  1.329905 -2.410841 -0.034984
H  -0.569115 -0.114258 -0.627904
H  5.953504 -1.27675 1.285183
H  2.849602 -4.167629 0.744566
H  5.15442 -3.598706 1.445989
H  -7.100183 -0.255063 -0.84063
H  -7.981839 -0.218426 0.684398
H  -3.984487 0.491309 -3.235972
H  4.385954 3.359217 -0.445269
H  5.933272 2.765459 -1.095884
H  4.505353 2.86245 -2.145191
H  -6.539502 2.191708 -0.552161
H  -8.277476 1.913816 -0.522415
H  -7.414897 2.194851 0.986481
H  -1.267173 1.179557 -2.838569
H  -1.97937 0.526253 -4.309765
H  -1.32569 -0.57308 -3.101987
H  -1.840021 -0.556738 2.554842
elementType: S O N C H
totalener: -1760.72973545 hartree
nucrepener: 2929.15570534 hartree
electener: -4689.88544080 hartree
oneelecener: -8236.45645071 hartree
twoeener: 3546.57100991 hartree
cpcmener: -0.06297848 hartree
kineticenergy: 1754.38650113 hartree
xcener: -145.161219504172 hartree
chargesum: 0.0000000
charge: 0.900814 -0.503394 -0.517484 -0.267105 -0.453229 -0.300439 -0.469009 -0.245316 -0.132845 -0.450960 -0.421746 -0.428826 -0.178529 -0.141359 0.105413 -0.033814 -0.208947 -0.175720 -0.091307 0.469771 0.385730 0.385487 0.390173 0.440721 0.062227 -0.127541 -0.269404 -0.179391 0.155418 0.222809 0.151098 0.169446 0.169769 0.090178 0.114226 0.182172 0.120541 0.128411 0.131472 0.089990 0.096427 0.091385 0.107401 0.130147 0.112102 0.193039
qa: 0.9008 -0.5034 -0.5175 -0.2671 -0.4532 -0.3004 -0.4690 -0.2453 -0.1328 -0.4510 -0.4217 -0.4288 -0.1785 -0.1414 0.1054 -0.0338 -0.2089 -0.1757 -0.0913 0.4698 0.3857 0.3855 0.3902 0.4407 0.0622 -0.1275 -0.2694 -0.1794 0.1554 0.2228 0.1511 0.1694 0.1698 0.0902 0.1142 0.1822 0.1205 0.1284 0.1315 0.0900 0.0964 0.0914 0.1074 0.1301 0.1121 0.1930
va: 5.7548 1.9686 1.9579 2.1244 2.0481 2.1128 2.0447 3.0939 3.2004 2.9724 2.9618 2.9277 3.2383 3.8241 3.6195 3.8058 4.0344 3.9551 3.8840 4.0930 4.4002 4.2401 4.1963 4.2783 3.8164 3.8470 3.9291 3.8839 1.0049 1.0607 1.0090 0.9867 0.9851 1.0154 0.9929 1.0101 0.9961 0.9933 0.9945 1.0094 1.0069 1.0039 0.9979 0.9982 0.9903 1.0175
dispcorr: -0.023737805 hartree
energy: -1760.753473259195
dipole: -16.84496 14.18809 -2.65687 3.49517 -5.34801 -1.85283 -11.59465 8.44708 -3.14757
magnitude: 4.51654 au
magnitude: 11.48014 debye
