program: Gaussian 09
title: 000069030
version: EM64L-G09RevD.01
frameworkgroup: C1[X(C14H14O2S)]
method: RPBEPBE
basis: SDD
operation: Freq
keyword: #p
keyword: freq=noraman
keyword: PBEPBE/SDD
title: #p freq=noraman PBEPBE/SDD
converged: YES YES NO NO
title: Mulliken charges:
elementType: S O O C C C C C C C C C C C C C C H H H H H H H H H H H H H H
charge: 0.866255 -0.540075 -0.540085 -0.064477 -0.065126 -0.244061 -0.243712 -0.243344 -0.242966 0.449747 0.450371 -0.366979 -0.367579 -0.365947 -0.366780 -0.800182 -0.800024 0.278770 0.279039 0.278393 0.278700 0.241869 0.241844 0.241830 0.241812 0.228753 0.228695 0.243819 0.230326 0.230393 0.240722
chargesum: 0.00000
title: Mulliken charges with hydrogens summed into heavy atoms:
elementType: S O O C C C C C C C C C C C C C C
charge: 0.866255 -0.540075 -0.540085 -0.064477 -0.065126 0.034709 0.035327 0.035049 0.035734 0.449747 0.450371 -0.125110 -0.125735 -0.124118 -0.124968 -0.098916 -0.098583
polarizability: 2.30207119e+02 -4.45696127e-01 1.39304241e+02 -1.33208015e-01 1.43766378e-02 1.71454991e+02
1716.lowfreq: -18.6731 -9.0271 -7.0353 -0.0019 -0.0014 -0.0001 0.4016 22.2867 29.7509
frequency: -18.4362 22.0859 29.7508 38.3656 52.4342 95.8025 115.3230 138.9705 155.8000 219.4381 225.0226 256.7382 282.8506 307.9838 314.1287 361.6611 399.3311 404.7305 407.6722 408.5403 444.8026 506.9830 513.1941 574.9585 600.8982 621.8489 623.4086 710.6823 712.3512 768.6010 778.7705 793.1697 830.4079 836.3924 849.8282 854.2450 921.4455 960.0104 964.3826 978.7549 982.1777 990.1369 992.1836 994.2445 997.5799 1049.4134 1049.7804 1051.2340 1057.0846 1114.7889 1120.1991 1180.1209 1184.9229 1217.1491 1218.2457 1292.7303 1296.0331 1380.1001 1383.2190 1388.7487 1390.5545 1399.4117 1399.5253 1472.0141 1472.4508 1473.2612 1474.4294 1475.3293 1476.1402 1595.5777 1596.2578 1596.3985 1600.4381 2980.4475 2981.0267 3063.0938 3063.4727 3091.6852 3092.0833 3132.6977 3133.2354 3134.0851 3134.8136 3157.1966 3158.8565 3160.3666 3162.1276
redmass: 1.0202 3.6183 4.7181 3.9788 1.0138 4.2879 6.9992 4.2300 6.4655 7.9709 8.3610 6.1616 4.6084 5.5709 3.4406 2.7843 7.7254 3.3928 2.9472 3.6794 5.7088 3.3410 2.9249 5.6179 6.2916 6.9470 6.9790 3.1885 3.2936 6.6520 4.7973 6.8947 1.3706 1.4107 1.2445 1.2445 14.3589 1.3192 1.3218 1.3850 1.3819 1.3905 1.4059 5.4815 5.2428 1.6064 1.5962 2.3932 2.5005 1.2744 1.2868 1.1530 1.1499 2.9582 2.9695 1.2709 1.2641 6.1198 6.8058 3.0256 2.8744 1.2205 1.2190 1.0975 1.1006 2.3549 1.0609 1.1133 2.1606 6.0612 6.0494 6.9740 7.0713 1.0388 1.0387 1.0949 1.0951 1.1000 1.1000 1.0888 1.0889 1.0889 1.0891 1.0953 1.0951 1.0967 1.0966
irintensity: 0.6449 0.0058 0.9318 0.2754 0.3729 0.7874 2.1973 0.5930 0.0001 17.7075 2.5769 0.0002 2.9331 7.3530 1.0593 0.0003 8.3433 0.0009 0.0546 0.0026 52.7282 85.9425 61.1222 6.8264 82.1650 0.0013 0.5448 3.6945 0.9620 35.1789 1.6016 78.8790 22.6355 36.2095 0.0116 0.6827 68.0180 0.0593 2.5272 0.1095 0.1839 0.0113 2.5696 5.6640 0.6060 34.0785 14.4311 32.6616 11.7421 0.0091 18.2454 19.5672 1.0156 9.4159 2.6172 0.0155 6.3271 0.0019 0.6310 0.0258 19.7479 17.1778 12.6416 0.2593 33.0615 43.9396 15.8007 6.5966 12.5125 6.8761 7.3357 0.1926 0.1018 28.3487 25.5216 20.3367 18.9601 14.6009 15.4973 3.7910 25.8402 13.1217 3.0037 0.0053 3.1763 14.8773 7.0952
temp: 298.150 k
press: 1.00000 atm
elementType: 16 8 8 6 6 6 6 6 6 6 6 6 6 6 6 6 6 1 1 1 1 1 1 1 1 1 1 1 1 1 1
symmnumber: 1
zpe: 627374.6 jmol-1
zpe.correction: 0.238954 hartree
zpe.thermalcorrener: 0.255129 hartree
zpe.thermalcorrenthalpy: 0.256073 hartree
zpe.thermalcorrgfe: 0.193028 hartree
zpe.sumelectzpe: -1089.019693 hartree
zpe.sumelectthermal: -1089.003518 hartree
zpe.sumelectthermalent: -1089.002574 hartree
zpe.sumelectthermalfe: -1089.065620 hartree
dipole: -0.0652 -7.1781 0.0000
dipole: 7.1783
quadrupole: -80.3500 -123.5370 -101.2536
quadrupole: -0.3566 -0.0244 0.0056
quadrupole: 21.3635 -21.8234 0.4599 -0.3566 -0.0244 0.0056
hfenergy: -1089.2586474 hartree
pointgroup: C01 [X(C14H14O2S1)]
dipole: -0.0231542 -2.8240854 -0.0005306 debye
polarizability: 230.2072291|-0.3652803|139.3035191|-0.2310871|0.0082906|171.4556022 unknown
InChI: InChI=1S/C14H14O2S/c1-11-3-7-13(8-4-11)17(15,16)14-9-5-12(2)6-10-14/h3-10H,1-2H3
charge 0 multiplicity 1
31 atoms
S  -0.002623 1.704949 0.000187
O  -0.006781 2.480854 -1.444154
O  -0.0030 2.480541 1.444734
C  -1.513176 0.558241 0.002108
C  1.512614 0.565392 -0.001926
C  -2.062349 0.186845 1.238271
C  2.065034 0.19901 -1.238121
C  -2.060789 0.179501 -1.232557
C  2.063765 0.191682 1.232666
C  -3.793878 -1.066848 0.005527
C  3.802995 -1.046107 -0.005561
C  -3.209223 -0.638183 1.227049
C  3.218772 -0.6164 -1.226968
C  -3.207535 -0.645568 -1.217827
C  3.217375 -0.623782 1.217816
C  -5.046816 -1.924172 0.007093
C  5.027284 -1.943858 -0.007461
H  -1.6214 0.553136 2.171343
H  1.625962 0.568611 -2.170765
H  -1.618989 0.540142 -2.167395
H  1.624088 0.555679 2.167195
H  -3.659414 -0.946024 2.177903
H  3.676045 -0.913772 -2.177745
H  -3.65646 -0.95919 -2.167401
H  3.673575 -0.926933 2.167292
H  -5.093881 -2.576673 -0.882004
H  -5.100856 -2.563347 0.90538
H  -5.954998 -1.290929 -0.001253
H  5.651421 -1.776544 -0.902264
H  5.654638 -1.775875 0.884994
H  4.7326 -3.011177 -0.006454
