program: Orca
programVersion: 4.2.1
elementType: S O O O O O O N N N N N N C C C C C C C C C C C C C C C H H H H H H H H H H H H H H H H H H
charge: 0
multiplicity: 1
keywords: wb97x-d3
keywords: def2-TZVPP
keywords: def2/J RIJCOSX GRIDX6 NOFINALGRIDX
keywords: grid4 nofinalgrid
keywords: scfconv7
keywords: smallprint printgap noloewdin
keywords: NOSOSCF
formula: C15H18N6O6S
InChI: InChI=1S/C15H18N6O6S/c1-4-27-15-19-12(16-2)17-13(20-15)18-14(23)21-28(24,25)10-8-6-5-7-9(10)11(22)26-3/h5-8,16,18,21H,4H2,1-3H3
46 atoms
S  1.881557 -0.319948 -1.507944
O  1.905164 1.12899 -1.596893
O  2.276198 -1.112651 -2.653219
O  2.836195 2.325629 1.268319
O  0.916177 1.177011 1.305242
O  -2.815665 2.322678 -0.341217
O  0.595604 -2.920786 -0.942877
N  0.310391 -0.672968 -1.106705
N  -1.427694 -2.058434 -0.436169
N  -3.527386 -1.535402 0.255144
N  -2.059831 0.175597 -0.421937
N  -4.225471 0.734552 0.303047
N  -5.629334 -0.927197 0.959462
C  2.859366 -0.816152 -0.116388
C  2.961971 0.013435 1.00102
C  3.593729 -1.987532 -0.210277
C  3.821944 -0.351556 2.02632
C  4.430679 -2.350359 0.834409
C  4.546155 -1.533131 1.946322
C  2.114015 1.228871 1.187449
C  -0.116556 -1.944117 -0.841294
C  -2.374974 -1.093634 -0.192743
C  -4.435688 -0.578529 0.495983
C  -3.03339 1.038918 -0.149646
C  -1.526895 2.757431 -0.808859
C  2.135777 3.556231 1.486156
C  -1.556839 4.260338 -0.907418
C  -6.0728 -2.26724 1.255212
H  3.528869 -2.613062 -1.088187
H  -0.345069 0.100124 -0.906722
H  3.91803 0.278417 2.900401
H  4.997595 -3.268135 0.768906
H  5.204874 -1.810067 2.757591
H  -0.759047 2.434087 -0.105414
H  -1.31794 2.309983 -1.782394
H  -6.276001 -0.17336 1.129041
H  2.898182 4.327727 1.522743
H  1.449522 3.767206 0.665487
H  1.587569 3.540578 2.427063
H  -1.739573 4.724795 0.061425
H  -0.588721 4.608037 -1.26775
H  -2.314287 4.60486 -1.611056
H  -5.280451 -2.979436 1.056299
H  -6.934918 -2.530898 0.643769
H  -6.357649 -2.352434 2.303084
H  -1.721201 -3.006914 -0.240519
elementType: S O N C H
totalener: -1760.73096136 hartree
nucrepener: 3024.68407151 hartree
electener: -4785.41503287 hartree
oneelecener: -8427.99109997 hartree
twoeener: 3642.57606710 hartree
cpcmener: -0.05360874 hartree
kineticenergy: 1754.37590137 hartree
xcener: -145.160595597123 hartree
chargesum: -0.0000000
charge: 0.887166 -0.516846 -0.505637 -0.271381 -0.439031 -0.293129 -0.480452 -0.200692 -0.133792 -0.444062 -0.446140 -0.407579 -0.161935 -0.123520 0.075800 -0.013184 -0.191048 -0.168727 -0.107429 0.453357 0.381252 0.373412 0.393598 0.419132 0.079350 -0.118601 -0.287145 -0.148287 0.145782 0.221695 0.151769 0.169552 0.169385 0.065854 0.104693 0.176928 0.137788 0.109460 0.125286 0.097408 0.091846 0.099113 0.110789 0.112570 0.112795 0.192839
qa: 0.8872 -0.5168 -0.5056 -0.2714 -0.4390 -0.2931 -0.4805 -0.2007 -0.1338 -0.4441 -0.4461 -0.4076 -0.1619 -0.1235 0.0758 -0.0132 -0.1910 -0.1687 -0.1074 0.4534 0.3813 0.3734 0.3936 0.4191 0.0794 -0.1186 -0.2871 -0.1483 0.1458 0.2217 0.1518 0.1696 0.1694 0.0659 0.1047 0.1769 0.1378 0.1095 0.1253 0.0974 0.0918 0.0991 0.1108 0.1126 0.1128 0.1928
va: 5.8047 1.9683 1.9918 2.1386 2.0545 2.1212 2.0346 3.0843 3.1954 2.9843 2.9237 2.9606 3.2285 3.7643 3.6995 3.8465 4.0243 3.9516 3.8954 4.0814 4.4038 4.2560 4.2241 4.2903 3.7884 3.8590 3.9885 3.8730 1.0242 1.0561 1.0057 0.9865 0.9852 1.0026 0.9938 1.0125 0.9946 0.9915 0.9935 1.0002 1.0038 1.0049 1.0177 0.9908 0.9912 1.0167
dispcorr: -0.025469512 hartree
energy: -1760.756430871876
dipole: -9.40304 8.40245 -1.00059 11.75887 -11.46104 0.29783 9.01263 -5.99938 3.01326
magnitude: 3.18898 au
magnitude: 8.10575 debye
