program: Orca
programVersion: 4.2.1
elementType: S O O O O O O N N N N N N C C C C C C C C C C C C C C C H H H H H H H H H H H H H H H H H H
charge: 0
multiplicity: 1
keywords: wb97x-d3
keywords: def2-TZVPP
keywords: def2/J RIJCOSX GRIDX6 NOFINALGRIDX
keywords: grid4 nofinalgrid
keywords: scfconv7
keywords: smallprint printgap noloewdin
keywords: NOSOSCF
formula: C15H18N6O6S
InChI: InChI=1S/C15H18N6O6S/c1-4-27-15-19-12(16-2)17-13(20-15)18-14(23)21-28(24,25)10-8-6-5-7-9(10)11(22)26-3/h5-8,16,18,21H,4H2,1-3H3
46 atoms
S  1.887537 -0.325295 -1.51006
O  1.912236 1.123974 -1.598928
O  2.283728 -1.119732 -2.652896
O  2.830975 2.319786 1.264977
O  0.908681 1.174421 1.307834
O  -2.816682 2.323146 -0.341849
O  0.594501 -2.925283 -0.952557
N  0.314852 -0.676373 -1.112991
N  -1.424773 -2.058569 -0.438664
N  -3.520386 -1.534848 0.263024
N  -2.057983 0.175938 -0.427772
N  -4.218646 0.734512 0.314436
N  -5.61918 -0.92723 0.97764
C  2.860268 -0.820083 -0.115336
C  2.952842 0.00711 1.004625
C  3.599301 -1.988781 -0.2069
C  3.803363 -0.360203 2.036885
C  4.428032 -2.352901 0.843802
C  4.529766 -1.540589 1.960568
C  2.106323 1.224465 1.186821
C  -0.114791 -1.946868 -0.847671
C  -2.371061 -1.092965 -0.193046
C  -4.427653 -0.578336 0.508644
C  -3.030247 1.038951 -0.148369
C  -1.534195 2.763686 -0.821266
C  2.133834 3.553057 1.479952
C  -1.569518 4.267277 -0.909587
C  -6.062501 -2.266437 1.277089
H  3.544684 -2.612676 -1.086648
H  -0.338099 0.098093 -0.912348
H  3.89054 0.267278 2.91358
H  4.998975 -3.268234 0.778938
H  5.180441 -1.819412 2.777692
H  -0.757639 2.438324 -0.128324
H  -1.335179 2.322727 -1.799835
H  -6.264809 -0.173751 1.152386
H  1.458678 3.769354 0.651918
H  1.574762 3.536552 2.414082
H  2.899011 4.320903 1.527764
H  -2.336025 4.614358 -1.602158
H  -1.742515 4.724474 0.064485
H  -0.606523 4.62047 -1.278052
H  -6.314156 -2.359336 2.332967
H  -5.283646 -2.98371 1.04565
H  -6.946425 -2.516161 0.69171
H  -1.71693 -3.007439 -0.243043
elementType: S O N C H
totalener: -1760.73108823 hartree
nucrepener: 3024.29815085 hartree
electener: -4785.02923908 hartree
oneelecener: -8427.22488839 hartree
twoeener: 3642.19564931 hartree
cpcmener: -0.05375501 hartree
kineticenergy: 1754.37300390 hartree
xcener: -145.159925603411 hartree
chargesum: 0.0000000
charge: 0.887407 -0.517656 -0.504753 -0.271063 -0.438876 -0.292899 -0.480218 -0.200794 -0.133652 -0.444124 -0.446733 -0.407730 -0.161886 -0.123729 0.076895 -0.014498 -0.190030 -0.167629 -0.108503 0.452209 0.381314 0.373480 0.393189 0.419702 0.081173 -0.119044 -0.288154 -0.148434 0.146101 0.221552 0.151653 0.169533 0.169442 0.063338 0.105606 0.176870 0.109574 0.125426 0.137929 0.099080 0.097020 0.092839 0.112768 0.110639 0.112835 0.192828
qa: 0.8874 -0.5177 -0.5048 -0.2711 -0.4389 -0.2929 -0.4802 -0.2008 -0.1337 -0.4441 -0.4467 -0.4077 -0.1619 -0.1237 0.0769 -0.0145 -0.1900 -0.1676 -0.1085 0.4522 0.3813 0.3735 0.3932 0.4197 0.0812 -0.1190 -0.2882 -0.1484 0.1461 0.2216 0.1517 0.1695 0.1694 0.0633 0.1056 0.1769 0.1096 0.1254 0.1379 0.0991 0.0970 0.0928 0.1128 0.1106 0.1128 0.1928
va: 5.8051 1.9671 1.9931 2.1385 2.0540 2.1213 2.0348 3.0847 3.1953 2.9843 2.9233 2.9605 3.2282 3.7660 3.7007 3.8479 4.0241 3.9505 3.8959 4.0814 4.4038 4.2560 4.2249 4.2893 3.7894 3.8585 3.9888 3.8730 1.0237 1.0558 1.0056 0.9865 0.9852 1.0021 0.9936 1.0126 0.9916 0.9935 0.9948 1.0048 1.0003 1.0037 0.9909 1.0177 0.9910 1.0168
dispcorr: -0.025449598 hartree
energy: -1760.756537827069
dipole: -9.44884 8.45144 -0.99740 11.80553 -11.50008 0.30545 9.04590 -6.03100 3.01490
magnitude: 3.19025 au
magnitude: 8.10898 debye
