program: Orca
programVersion: 4.2.1
elementType: S O O O O O O N N N N N N C C C C C C C C C C C C C C C H H H H H H H H H H H H H H H H H H
charge: 0
multiplicity: 1
keywords: wb97x-d3
keywords: def2-TZVPP
keywords: def2/J RIJCOSX GRIDX6 NOFINALGRIDX
keywords: grid4 nofinalgrid
keywords: scfconv7
keywords: smallprint printgap noloewdin
keywords: NOSOSCF
formula: C15H18N6O6S
InChI: InChI=1S/C15H18N6O6S/c1-4-27-15-19-12(16-2)17-13(20-15)18-14(23)21-28(24,25)10-8-6-5-7-9(10)11(22)26-3/h5-8,16,18,21H,4H2,1-3H3
46 atoms
S  1.828052 0.13135 1.598452
O  2.170539 -0.336497 2.924987
O  1.868895 1.553032 1.30565
O  2.791166 1.856661 -1.880773
O  0.892883 0.731424 -1.512398
O  -2.825086 2.406101 -0.383768
O  0.559757 -2.533482 1.586745
N  0.264716 -0.307332 1.251599
N  -1.41695 -1.829045 0.755623
N  -3.472245 -1.50319 -0.148771
N  -2.050819 0.339718 0.209617
N  -4.183913 0.689548 -0.715292
N  -5.538924 -1.099451 -1.070269
C  2.848156 -0.717069 0.423444
C  2.963957 -0.243401 -0.884823
C  3.609534 -1.785991 0.868056
C  3.862029 -0.86338 -1.741237
C  4.48644 -2.408619 -0.007793
C  4.612855 -1.947337 -1.307101
C  2.091146 0.83417 -1.438639
C  -0.142464 -1.612112 1.226554
C  -2.348924 -0.953115 0.251601
C  -4.373527 -0.637868 -0.634417
C  -3.01706 1.106928 -0.286752
C  -1.574884 2.993292 0.016338
C  2.063183 2.931536 -2.489019
C  -1.47019 3.186967 1.510456
C  -5.949439 -2.481331 -1.114636
H  3.534879 -2.134969 1.887351
H  -0.364169 0.39086 0.825122
H  3.967157 -0.512908 -2.759158
H  5.074564 -3.248094 0.335037
H  5.300554 -2.426941 -1.989691
H  -0.745143 2.407589 -0.379386
H  -1.564297 3.957539 -0.488572
H  -6.179424 -0.412502 -1.434772
H  1.510118 2.589767 -3.362734
H  1.377418 3.391593 -1.777789
H  2.80949 3.658856 -2.792603
H  -1.456944 2.24667 2.059755
H  -0.54182 3.714798 1.730469
H  -2.293442 3.794093 1.887039
H  -5.190104 -3.116286 -0.673227
H  -6.111452 -2.801565 -2.143447
H  -6.878078 -2.619895 -0.563195
H  -1.6991 -2.800591 0.759973
elementType: S O N C H
totalener: -1760.72875423 hartree
nucrepener: 3048.74225777 hartree
electener: -4809.47101200 hartree
oneelecener: -8476.22943478 hartree
twoeener: 3666.75842278 hartree
cpcmener: -0.05324248 hartree
kineticenergy: 1754.37287776 hartree
xcener: -145.160685794246 hartree
chargesum: 0.0000000
charge: 0.889221 -0.509394 -0.514282 -0.272229 -0.436974 -0.302686 -0.478470 -0.197992 -0.132356 -0.444701 -0.445077 -0.406129 -0.161381 -0.129597 0.076697 -0.008798 -0.191103 -0.167761 -0.107749 0.456235 0.374373 0.367817 0.390724 0.426407 0.075207 -0.123585 -0.273595 -0.149822 0.146857 0.217715 0.151879 0.169667 0.169620 0.044039 0.127547 0.176349 0.123816 0.116973 0.137219 0.083688 0.098199 0.103040 0.111551 0.112781 0.113133 0.192928
qa: 0.8892 -0.5094 -0.5143 -0.2722 -0.4370 -0.3027 -0.4785 -0.1980 -0.1324 -0.4447 -0.4451 -0.4061 -0.1614 -0.1296 0.0767 -0.0088 -0.1911 -0.1678 -0.1077 0.4562 0.3744 0.3678 0.3907 0.4264 0.0752 -0.1236 -0.2736 -0.1498 0.1469 0.2177 0.1519 0.1697 0.1696 0.0440 0.1275 0.1763 0.1238 0.1170 0.1372 0.0837 0.0982 0.1030 0.1116 0.1128 0.1131 0.1929
va: 5.7994 1.9857 1.9732 2.1390 2.0536 2.1161 2.0371 3.0972 3.1946 2.9844 2.9087 2.9614 3.2274 3.7716 3.6884 3.8380 4.0242 3.9500 3.8949 4.0762 4.4102 4.2584 4.2285 4.2749 3.8390 3.8568 3.9164 3.8725 1.0218 1.0520 1.0067 0.9863 0.9852 1.0211 0.9957 1.0129 0.9938 0.9895 0.9943 1.0132 1.0101 1.0063 1.0173 0.9906 0.9914 1.0168
dispcorr: -0.026547825 hartree
energy: -1760.755302054772
dipole: -8.87562 8.02628 -0.84934 6.31119 -6.80765 -0.49646 -8.82285 5.70554 -3.11732
magnitude: 3.26887 au
magnitude: 8.30881 debye
