program: Orca
programVersion: 4.2.1
elementType: S O O O O O O N N N N N N C C C C C C C C C C C C C C C H H H H H H H H H H H H H H H H H H
charge: 0
multiplicity: 1
keywords: wb97x-d3
keywords: def2-TZVPP
keywords: def2/J RIJCOSX GRIDX6 NOFINALGRIDX
keywords: grid4 nofinalgrid
keywords: scfconv7
keywords: smallprint printgap noloewdin
keywords: NOSOSCF
formula: C15H18N6O6S
InChI: InChI=1S/C15H18N6O6S/c1-4-27-15-19-12(16-2)17-13(20-15)18-14(23)21-28(24,25)10-8-6-5-7-9(10)11(22)26-3/h5-8,16,18,21H,4H2,1-3H3
46 atoms
S  1.631934 0.525853 -0.575941
O  1.47131 1.932152 -0.268707
O  2.106018 0.110225 -1.880261
O  4.484164 1.305539 -0.959423
O  5.440006 -0.653958 -1.471689
O  -3.449784 2.228919 0.347431
O  0.68657 -2.262083 -0.795876
N  0.121884 -0.11754 -0.306884
N  -1.496999 -1.776709 -0.505887
N  -3.758536 -1.65837 -0.357737
N  -2.462813 0.286358 -0.055627
N  -4.806828 0.420899 0.092534
N  -6.031655 -1.481781 -0.185999
C  2.640408 -0.261638 0.661602
C  3.993335 -0.492192 0.412961
C  2.056665 -0.66658 1.850845
C  4.738362 -1.187043 1.355816
C  2.822657 -1.330569 2.797106
C  4.157282 -1.601972 2.544407
C  4.708562 0.017201 -0.792513
C  -0.164358 -1.434575 -0.561171
C  -2.613561 -1.006594 -0.295325
C  -4.839396 -0.90134 -0.151549
C  -3.609191 0.945746 0.124377
C  -4.610245 3.054769 0.534249
C  5.020258 1.925016 -2.129614
C  -4.130482 4.468237 0.739777
C  -6.247919 -2.879287 -0.468337
H  1.007906 -0.488634 2.046125
H  -0.664543 0.524918 -0.117823
H  5.785563 -1.384528 1.169021
H  2.366066 -1.645706 3.725151
H  4.752032 -2.133808 3.274426
H  -5.256187 2.984038 -0.342809
H  -5.177037 2.702611 1.398093
H  -6.830594 -0.880314 -0.067412
H  4.649463 1.44675 -3.035913
H  4.680284 2.956027 -2.101535
H  6.109681 1.903556 -2.125204
H  -3.572279 4.834705 -0.122174
H  -4.994397 5.11866 0.877076
H  -3.502314 4.558125 1.626425
H  -7.289008 -3.110003 -0.259543
H  -5.625621 -3.513783 0.16065
H  -6.045021 -3.124783 -1.512319
H  -1.680231 -2.757272 -0.676124
elementType: S O N C H
totalener: -1760.73624229 hartree
nucrepener: 2905.70748312 hartree
electener: -4666.44372541 hartree
oneelecener: -8190.13995312 hartree
twoeener: 3523.69622771 hartree
cpcmener: -0.05278456 hartree
kineticenergy: 1754.38262785 hartree
xcener: -145.155635920939 hartree
chargesum: -0.0000000
charge: 0.882586 -0.505951 -0.489009 -0.265325 -0.428578 -0.286614 -0.447218 -0.229445 -0.134110 -0.450777 -0.422548 -0.428929 -0.184345 -0.146738 0.111117 -0.031427 -0.210590 -0.178165 -0.090492 0.453991 0.369855 0.391076 0.390999 0.430953 0.050841 -0.128167 -0.253526 -0.153424 0.150258 0.212582 0.148457 0.165309 0.165567 0.096210 0.096568 0.179500 0.119755 0.130294 0.124768 0.089442 0.090298 0.089159 0.116646 0.105047 0.112809 0.191290
qa: 0.8826 -0.5060 -0.4890 -0.2653 -0.4286 -0.2866 -0.4472 -0.2294 -0.1341 -0.4508 -0.4225 -0.4289 -0.1843 -0.1467 0.1111 -0.0314 -0.2106 -0.1782 -0.0905 0.4540 0.3699 0.3911 0.3910 0.4310 0.0508 -0.1282 -0.2535 -0.1534 0.1503 0.2126 0.1485 0.1653 0.1656 0.0962 0.0966 0.1795 0.1198 0.1303 0.1248 0.0894 0.0903 0.0892 0.1166 0.1050 0.1128 0.1913
va: 5.7881 1.9731 1.9902 2.1217 2.0787 2.1280 2.0690 3.0797 3.1878 2.9675 2.9456 2.9564 3.2113 3.8236 3.6138 3.8151 4.0394 3.9599 3.8869 4.1178 4.4150 4.2202 4.2409 4.2348 3.8209 3.8529 3.9670 3.8913 1.0081 1.0728 1.0097 0.9885 0.9865 0.9993 0.9986 1.0120 0.9965 0.9943 0.9938 1.0037 1.0053 1.0033 0.9965 0.9987 0.9929 1.0188
dispcorr: -0.021980371 hartree
energy: -1760.758222657431
dipole: -19.61093 15.14844 -4.46250 7.88377 -7.91497 -0.03120 5.01194 -2.55391 2.45803
magnitude: 5.09478 au
magnitude: 12.94989 debye
