program: Orca
programVersion: 4.2.1
elementType: S O O O O O O N N N N N N C C C C C C C C C C C C C C C H H H H H H H H H H H H H H H H H H
charge: 0
multiplicity: 1
keywords: wb97x-d3
keywords: def2-TZVPP
keywords: def2/J RIJCOSX GRIDX6 NOFINALGRIDX
keywords: grid4 nofinalgrid
keywords: scfconv7
keywords: smallprint printgap noloewdin
keywords: NOSOSCF
formula: C15H18N6O6S
InChI: InChI=1S/C15H18N6O6S/c1-4-27-15-19-12(16-2)17-13(20-15)18-14(23)21-28(24,25)10-8-6-5-7-9(10)11(22)26-3/h5-8,16,18,21H,4H2,1-3H3
46 atoms
S  1.68525 0.251421 -0.727145
O  2.132515 1.606587 -0.47355
O  1.530657 -0.226951 -2.086721
O  4.492015 0.565969 -1.601231
O  5.511992 1.327861 0.241184
O  -5.994629 0.610605 0.806064
O  0.681209 0.794381 2.02425
N  0.180564 0.032275 -0.059193
N  -1.493548 0.544672 1.465673
N  -2.366059 -0.066167 -0.594769
N  -3.752148 0.578478 1.191754
N  -4.709114 -0.001875 -0.888784
N  -3.314587 -0.619034 -2.595341
C  2.717489 -0.855675 0.206536
C  4.07156 -0.563156 0.375574
C  2.153635 -1.976479 0.793485
C  4.838033 -1.386774 1.188391
C  2.941044 -2.807968 1.576314
C  4.276997 -2.506576 1.784145
C  4.762189 0.566294 -0.311263
C  -0.142672 0.487507 1.194804
C  -2.571939 0.339302 0.642459
C  -3.472836 -0.222781 -1.339234
C  -4.77589 0.38975 0.367855
C  -6.19088 1.058122 2.156878
C  4.990433 1.651645 -2.384212
C  -7.667375 1.29603 2.343142
C  -2.03204 -0.875202 -3.205685
H  1.104617 -2.20482 0.663972
H  -0.607981 -0.176053 -0.697965
H  5.886019 -1.163055 1.339124
H  2.49929 -3.682736 2.033563
H  4.888438 -3.143838 2.40842
H  -5.825609 0.299644 2.852395
H  -5.623772 1.974466 2.330824
H  -4.149728 -0.729792 -3.147037
H  4.605929 1.494906 -3.38777
H  4.633813 2.609746 -2.006235
H  6.07984 1.652548 -2.410726
H  -7.845525 1.632398 3.364691
H  -8.039491 2.068767 1.669291
H  -8.248147 0.386324 2.186315
H  -1.399564 0.013752 -3.217231
H  -2.203594 -1.176646 -4.235359
H  -1.494765 -1.681551 -2.704258
H  -1.719511 0.848969 2.404125
elementType: S O N C H
totalener: -1760.73554981 hartree
nucrepener: 2920.98269112 hartree
electener: -4681.71824093 hartree
oneelecener: -8219.72725012 hartree
twoeener: 3538.00900919 hartree
cpcmener: -0.05176846 hartree
kineticenergy: 1754.37968699 hartree
xcener: -145.156204886022 hartree
chargesum: -0.0000000
charge: 0.890567 -0.488029 -0.507529 -0.265248 -0.428742 -0.278193 -0.440663 -0.247453 -0.137127 -0.446762 -0.445098 -0.399480 -0.176186 -0.139517 0.105839 -0.033466 -0.208623 -0.177131 -0.090679 0.453398 0.369626 0.377061 0.395208 0.427335 0.049586 -0.128174 -0.252869 -0.177588 0.151306 0.218704 0.149062 0.165099 0.164971 0.097818 0.095385 0.176134 0.129940 0.120018 0.125420 0.089906 0.088674 0.088927 0.107424 0.127502 0.111298 0.192347
qa: 0.8906 -0.4880 -0.5075 -0.2652 -0.4287 -0.2782 -0.4407 -0.2475 -0.1371 -0.4468 -0.4451 -0.3995 -0.1762 -0.1395 0.1058 -0.0335 -0.2086 -0.1771 -0.0907 0.4534 0.3696 0.3771 0.3952 0.4273 0.0496 -0.1282 -0.2529 -0.1776 0.1513 0.2187 0.1491 0.1651 0.1650 0.0978 0.0954 0.1761 0.1299 0.1200 0.1254 0.0899 0.0887 0.0889 0.1074 0.1275 0.1113 0.1923
va: 5.7748 1.9876 1.9702 2.1217 2.0784 2.1243 2.0793 3.0875 3.1932 2.9737 2.9382 2.9730 3.2255 3.8318 3.6176 3.8135 4.0353 3.9618 3.8874 4.1160 4.4184 4.2564 4.1897 4.3039 3.8203 3.8522 3.9667 3.8870 1.0076 1.0631 1.0099 0.9885 0.9867 0.9969 0.9981 1.0151 0.9945 0.9964 0.9937 1.0056 1.0035 1.0034 0.9973 0.9980 0.9906 1.0170
dispcorr: -0.023280712 hartree
energy: -1760.758830519849
dipole: -16.40807 14.20961 -2.19846 -1.82666 -0.56656 -2.39322 -0.63374 0.31245 -0.32129
magnitude: 3.26557 au
magnitude: 8.30042 debye
