program: Orca
programVersion: 4.2.1
elementType: S O O O O O O N N N N N N C C C C C C C C C C C C C C C H H H H H H H H H H H H H H H H H H
charge: 0
multiplicity: 1
keywords: wb97x-d3
keywords: def2-TZVPP
keywords: def2/J RIJCOSX GRIDX6 NOFINALGRIDX
keywords: grid4 nofinalgrid
keywords: scfconv7
keywords: smallprint printgap noloewdin
keywords: NOSOSCF
formula: C15H18N6O6S
InChI: InChI=1S/C15H18N6O6S/c1-4-27-15-19-12(16-2)17-13(20-15)18-14(23)21-28(24,25)10-8-6-5-7-9(10)11(22)26-3/h5-8,16,18,21H,4H2,1-3H3
46 atoms
S  1.637279 0.388371 -0.743397
O  2.072668 1.731954 -0.418627
O  1.501442 -0.02802 -2.124826
O  4.4557 0.755569 -1.57478
O  5.44734 1.444028 0.311049
O  -6.076555 0.492136 0.773074
O  0.590217 0.810095 2.010927
N  0.124031 0.131349 -0.107993
N  -1.57266 0.519481 1.430058
N  -2.428815 -0.031658 -0.65543
N  -3.829209 0.503954 1.157158
N  -4.774562 -0.01196 -0.942566
N  -3.37334 -0.517207 -2.676984
C  2.667015 -0.75277 0.151522
C  4.01747 -0.459098 0.346555
C  2.10648 -1.903101 0.681455
C  4.782717 -1.314736 1.126212
C  2.893465 -2.765396 1.430559
C  4.225287 -2.46552 1.663052
C  4.709227 0.702679 -0.28271
C  -0.220369 0.516157 1.163424
C  -2.644723 0.318258 0.59745
C  -3.533749 -0.181553 -1.403703
C  -4.850913 0.321292 0.329706
C  -6.306693 0.83418 2.149038
C  4.965256 1.871195 -2.306136
C  -6.260579 -0.374277 3.0528
C  -2.091225 -0.718932 -3.307424
H  1.060402 -2.133001 0.53239
H  -0.645827 -0.087633 -0.76173
H  5.827695 -1.091684 1.295784
H  2.454694 -3.663972 1.841775
H  4.836754 -3.127979 2.260311
H  -5.601515 1.600432 2.471421
H  -7.302967 1.273834 2.149658
H  -4.210013 -0.621526 -3.227382
H  6.054816 1.875377 -2.312768
H  4.599763 1.752296 -3.32182
H  4.599295 2.813356 -1.898462
H  -6.541596 -0.071971 4.062551
H  -6.965386 -1.140625 2.728807
H  -5.264715 -0.813262 3.10312
H  -1.475595 0.180775 -3.279481
H  -2.265519 -0.972382 -4.349183
H  -1.535644 -1.53856 -2.85045
H  -1.809257 0.778187 2.379471
elementType: S O N C H
totalener: -1760.73427710 hartree
nucrepener: 2933.37538316 hartree
electener: -4694.10966026 hartree
oneelecener: -8244.46503590 hartree
twoeener: 3550.35537564 hartree
cpcmener: -0.05153777 hartree
kineticenergy: 1754.38999093 hartree
xcener: -145.159283578271 hartree
chargesum: -0.0000000
charge: 0.887907 -0.487895 -0.505175 -0.265169 -0.428743 -0.288050 -0.441825 -0.243637 -0.139565 -0.451278 -0.450391 -0.398352 -0.176557 -0.141239 0.107000 -0.032670 -0.209466 -0.177518 -0.090843 0.454324 0.368107 0.382634 0.394267 0.428316 0.061691 -0.127965 -0.270784 -0.176219 0.150925 0.221252 0.149134 0.165147 0.165257 0.088999 0.113268 0.175872 0.125049 0.129808 0.120119 0.095551 0.090181 0.090576 0.106948 0.127283 0.111545 0.192181
qa: 0.8879 -0.4879 -0.5052 -0.2652 -0.4287 -0.2880 -0.4418 -0.2436 -0.1396 -0.4513 -0.4504 -0.3984 -0.1766 -0.1412 0.1070 -0.0327 -0.2095 -0.1775 -0.0908 0.4543 0.3681 0.3826 0.3943 0.4283 0.0617 -0.1280 -0.2708 -0.1762 0.1509 0.2213 0.1491 0.1651 0.1653 0.0890 0.1133 0.1759 0.1250 0.1298 0.1201 0.0956 0.0902 0.0906 0.1069 0.1273 0.1115 0.1922
va: 5.7791 1.9881 1.9735 2.1219 2.0785 2.1254 2.0775 3.0910 3.2000 2.9722 2.9225 2.9725 3.2240 3.8325 3.6181 3.8120 4.0368 3.9624 3.8880 4.1150 4.4195 4.2379 4.1927 4.3026 3.8208 3.8528 3.9264 3.8878 1.0078 1.0575 1.0098 0.9885 0.9865 1.0143 0.9931 1.0153 0.9938 0.9946 0.9962 1.0071 1.0040 1.0102 0.9971 0.9977 0.9907 1.0171
dispcorr: -0.023684528 hartree
energy: -1760.757961626205
dipole: -13.22144 11.10727 -2.11417 -5.54183 3.01210 -2.52974 0.75984 -1.16840 -0.40856
magnitude: 3.32208 au
magnitude: 8.44404 debye
