program: Orca
programVersion: 4.2.1
elementType: S O O O O O O N N N N N N C C C C C C C C C C C C C C C H H H H H H H H H H H H H H H H H H
charge: 0
multiplicity: 1
keywords: wb97x-d3
keywords: def2-TZVPP
keywords: def2/J RIJCOSX GRIDX6 NOFINALGRIDX
keywords: grid4 nofinalgrid
keywords: scfconv7
keywords: smallprint printgap noloewdin
keywords: NOSOSCF
formula: C15H18N6O6S
InChI: InChI=1S/C15H18N6O6S/c1-4-27-15-19-12(16-2)17-13(20-15)18-14(23)21-28(24,25)10-8-6-5-7-9(10)11(22)26-3/h5-8,16,18,21H,4H2,1-3H3
46 atoms
S  1.422977 -2.345903 -0.064651
O  1.614767 -3.196505 -1.22027
O  0.884701 -2.922525 1.149801
O  1.21969 -0.302883 2.416641
O  1.588478 1.566353 1.247465
O  -4.227416 3.076611 -1.176594
O  1.578395 -0.293142 -2.180134
N  0.381393 -1.098671 -0.426029
N  -0.413031 0.664482 -1.711651
N  -1.979131 0.000727 -0.131476
N  -2.313297 1.889466 -1.494167
N  -3.957972 1.276257 0.084379
N  -3.61101 -0.594441 1.352486
C  2.957684 -1.501728 0.243353
C  3.026968 -0.294541 0.939694
C  4.098496 -2.08349 -0.287662
C  4.261371 0.327994 1.069842
C  5.329195 -1.471287 -0.106858
C  5.409309 -0.263893 0.565337
C  1.858393 0.426842 1.527562
C  0.583308 -0.261114 -1.493864
C  -1.614125 0.846848 -1.075787
C  -3.181466 0.244347 0.417268
C  -3.467619 2.052971 -0.860762
C  -3.784782 4.000805 -2.183867
C  0.118857 0.305927 3.095642
C  -4.81921 5.092049 -2.282006
C  -2.919408 -1.798487 1.742464
H  4.039871 -3.002717 -0.852923
H  -0.537848 -1.059666 0.043966
H  4.32902 1.278165 1.582876
H  6.218064 -1.933007 -0.513899
H  6.363665 0.228874 0.691064
H  -2.811368 4.410126 -1.908314
H  -3.673254 3.480532 -3.137029
H  -4.523619 -0.412396 1.737351
H  -0.274179 -0.452554 3.765829
H  0.445929 1.165216 3.680869
H  -0.656588 0.623898 2.399584
H  -5.794991 4.70144 -2.572233
H  -4.925345 5.633716 -1.341614
H  -4.507482 5.806781 -3.043858
H  -2.820868 -2.50267 0.915135
H  -3.494561 -2.278655 2.528694
H  -1.925226 -1.592259 2.139679
H  -0.21601 1.322586 -2.455154
elementType: S O N C H
totalener: -1760.73349743 hartree
nucrepener: 3038.97670862 hartree
electener: -4799.71020605 hartree
oneelecener: -8455.59028651 hartree
twoeener: 3655.88008046 hartree
cpcmener: -0.04886299 hartree
kineticenergy: 1754.38477482 hartree
xcener: -145.157117864907 hartree
chargesum: -0.0000000
charge: 0.873766 -0.493302 -0.496140 -0.244681 -0.418444 -0.277795 -0.436330 -0.230181 -0.124664 -0.455233 -0.442275 -0.396799 -0.175824 -0.148166 0.107537 -0.040247 -0.199574 -0.166542 -0.108129 0.442728 0.358361 0.377809 0.392396 0.426403 0.051511 -0.143505 -0.255499 -0.164133 0.149146 0.209498 0.145868 0.165248 0.165267 0.096357 0.097558 0.177185 0.140236 0.140464 0.102027 0.089341 0.088971 0.090277 0.123166 0.129317 0.084284 0.192742
qa: 0.8738 -0.4933 -0.4961 -0.2447 -0.4184 -0.2778 -0.4363 -0.2302 -0.1247 -0.4552 -0.4423 -0.3968 -0.1758 -0.1482 0.1075 -0.0402 -0.1996 -0.1665 -0.1081 0.4427 0.3584 0.3778 0.3924 0.4264 0.0515 -0.1435 -0.2555 -0.1641 0.1491 0.2095 0.1459 0.1652 0.1653 0.0964 0.0976 0.1772 0.1402 0.1405 0.1020 0.0893 0.0890 0.0903 0.1232 0.1293 0.0843 0.1927
va: 5.8042 2.0066 1.9783 2.1395 2.0728 2.1262 2.0828 3.0541 3.1997 2.9475 2.9423 2.9810 3.2235 3.8271 3.5737 3.8982 4.0325 3.9612 3.9017 4.0832 4.4170 4.2473 4.1797 4.3047 3.8171 3.8459 3.9666 3.8991 1.0167 1.0644 1.0101 0.9884 0.9872 0.9982 0.9973 1.0147 0.9867 0.9989 0.9979 1.0035 1.0035 1.0054 0.9911 0.9979 0.9838 1.0171
dispcorr: -0.026775646 hartree
energy: -1760.760273075375
dipole: -13.96308 13.21705 -0.74603 14.32029 -12.94975 1.37053 3.89967 -2.47857 1.42110
magnitude: 2.11056 au
magnitude: 5.36461 debye
