program: Orca
programVersion: 4.2.1
elementType: S O O O O O O N N N N N N C C C C C C C C C C C C C C C H H H H H H H H H H H H H H H H H H
charge: 0
multiplicity: 1
keywords: wb97x-d3
keywords: def2-TZVPP
keywords: def2/J RIJCOSX GRIDX6 NOFINALGRIDX
keywords: grid4 nofinalgrid
keywords: scfconv7
keywords: smallprint printgap noloewdin
keywords: NOSOSCF
formula: C15H18N6O6S
InChI: InChI=1S/C15H18N6O6S/c1-4-27-15-19-12(16-2)17-13(20-15)18-14(23)21-28(24,25)10-8-6-5-7-9(10)11(22)26-3/h5-8,16,18,21H,4H2,1-3H3
46 atoms
S  1.434447 -2.300919 0.161154
O  1.757686 -3.441814 -0.666586
O  1.006229 -2.501098 1.53286
O  2.23771 0.15932 3.301796
O  0.738178 0.520195 1.683027
O  -4.228196 2.838568 -1.682817
O  1.198875 -1.12904 -2.547121
N  0.189935 -1.449861 -0.535997
N  -0.727065 -0.030219 -2.127054
N  -2.014451 -0.077041 -0.198818
N  -2.480426 1.408313 -1.962399
N  -3.821922 1.43466 -0.019533
N  -3.335863 -0.03554 1.663195
C  2.824509 -1.197466 0.155782
C  2.937019 -0.185076 1.110769
C  3.839965 -1.437409 -0.755755
C  4.094272 0.58109 1.133541
C  4.978892 -0.646354 -0.733942
C  5.105063 0.359118 0.208793
C  1.833536 0.182113 2.048931
C  0.287547 -0.898902 -1.783952
C  -1.78004 0.443116 -1.385987
C  -3.056616 0.452395 0.461251
C  -3.480619 1.861925 -1.218245
C  -3.924689 3.412828 -2.963554
C  1.300017 0.57338 4.299705
C  -4.891814 4.54604 -3.190591
C  -2.590168 -1.093319 2.300941
H  3.757192 -2.237095 -1.477015
H  -0.585508 -1.126847 0.065081
H  4.204499 1.371449 1.864096
H  5.767022 -0.826775 -1.45177
H  5.994599 0.973845 0.233636
H  -2.894587 3.773442 -2.973129
H  -4.021522 2.653186 -3.741552
H  -4.119722 0.370481 2.147319
H  1.819301 0.484879 5.249233
H  0.991051 1.607559 4.150025
H  0.42183 -0.071791 4.308807
H  -5.925823 4.200488 -3.204244
H  -4.792343 5.319844 -2.428746
H  -4.68104 5.003243 -4.157503
H  -2.626492 -2.021319 1.729087
H  -3.035932 -1.280368 3.273693
H  -1.546324 -0.81879 2.454294
H  -0.622787 0.38934 -3.041989
elementType: S O N C H
totalener: -1760.73715097 hartree
nucrepener: 3002.69134340 hartree
electener: -4763.42849437 hartree
oneelecener: -8383.74850395 hartree
twoeener: 3620.32000958 hartree
cpcmener: -0.04541790 hartree
kineticenergy: 1754.38688559 hartree
xcener: -145.157610219521 hartree
chargesum: -0.0000000
charge: 0.884236 -0.494275 -0.508383 -0.270174 -0.421849 -0.279962 -0.453883 -0.204810 -0.138093 -0.431619 -0.443903 -0.400611 -0.175535 -0.147522 0.083090 -0.002010 -0.196835 -0.165967 -0.106225 0.449756 0.362401 0.364557 0.392805 0.424908 0.050878 -0.126562 -0.253631 -0.163032 0.145908 0.225010 0.146936 0.165050 0.165041 0.094966 0.096835 0.174205 0.134226 0.120556 0.118309 0.088762 0.088397 0.089911 0.118255 0.127348 0.082036 0.190499
qa: 0.8842 -0.4943 -0.5084 -0.2702 -0.4218 -0.2800 -0.4539 -0.2048 -0.1381 -0.4316 -0.4439 -0.4006 -0.1755 -0.1475 0.0831 -0.0020 -0.1968 -0.1660 -0.1062 0.4498 0.3624 0.3646 0.3928 0.4249 0.0509 -0.1266 -0.2536 -0.1630 0.1459 0.2250 0.1469 0.1651 0.1650 0.0950 0.0968 0.1742 0.1342 0.1206 0.1183 0.0888 0.0884 0.0899 0.1183 0.1273 0.0820 0.1905
va: 5.8198 2.0062 1.9811 2.1383 2.0719 2.1207 2.0664 3.0793 3.1865 2.9707 2.9365 2.9772 3.2228 3.7945 3.6768 3.8400 4.0317 3.9552 3.9004 4.0881 4.4235 4.2706 4.1946 4.3054 3.8205 3.8663 3.9669 3.8951 1.0238 1.0499 1.0097 0.9881 0.9869 0.9982 0.9970 1.0162 0.9944 0.9931 0.9876 1.0034 1.0036 1.0054 0.9931 0.9986 0.9946 1.0185
dispcorr: -0.024972557 hartree
energy: -1760.762123522546
dipole: -11.08171 11.17677 0.09506 17.17098 -14.47708 2.69391 3.40217 -2.13265 1.26952
magnitude: 2.97957 au
magnitude: 7.57347 debye
